program: Gaussian 09
title: 000280681
version: EM64L-G09RevD.01
frameworkgroup: C1[X(C5H2BrClN2O2)]
method: RPBEPBE
basis: SDD
operation: Freq
keyword: #p
keyword: freq=noraman
keyword: PBEPBE/SDD
title: #p freq=noraman PBEPBE/SDD
converged: NO NO NO NO
title: Mulliken charges:
elementType: Br Cl O O N N C C C C C H H
charge: 0.139346 0.000256 -0.198692 -0.165784 0.041858 0.071906 0.459948 -0.164211 -0.412551 -0.051773 -0.333220 0.326189 0.286728
chargesum: 0.00000
title: Mulliken charges with hydrogens summed into heavy atoms:
elementType: Br Cl O O N N C C C C C
charge: 0.139346 0.000256 -0.198692 -0.165784 0.041858 0.071906 0.459948 0.161978 -0.412551 -0.051773 -0.046492
polarizability: 1.70021916e+02 1.18804677e+00 1.07055131e+02 -3.20385826e-02 -2.03501531e-02 3.48884247e+01
1716.lowfreq: -36.7607 -8.5834 -5.0014 -0.0021 -0.0013 0.0014 1.6096 60.6295 146.4635
frequency: -36.7158 60.6186 146.4618 166.0815 173.5613 247.2853 297.2647 323.9046 369.1422 440.1187 447.6547 502.5841 546.5251 626.4029 682.7052 719.2424 742.5628 832.7327 913.3350 946.7934 998.8239 1086.4763 1098.2168 1181.2392 1202.4753 1317.2094 1338.0736 1375.5457 1411.9022 1514.3796 1556.1766 3166.4318 3185.4043
redmass: 16.3659 10.0412 6.8582 19.4826 20.4567 29.9870 8.0843 12.4767 9.0343 5.0806 11.4592 4.2229 8.6820 9.1882 8.6941 12.7064 5.9458 11.5729 1.5061 1.3791 7.7411 7.1137 1.7327 14.7491 2.3928 4.4562 3.3565 4.0246 3.4694 8.9604 7.8174 1.0939 1.0928
irintensity: 0.0029 0.0704 3.5403 1.1919 0.0727 1.7551 1.0454 1.8893 1.6268 1.2988 15.9605 16.6918 36.6158 2.0781 0.0632 34.3635 8.3761 15.1130 18.5057 11.1470 70.4816 33.2108 31.8883 200.2601 78.2799 7.7420 49.1091 8.9285 292.2265 31.6053 6.3104 3.4052 15.4370
temp: 298.150 k
press: 1.00000 atm
elementType: 35 17 8 8 7 7 6 6 6 6 6 1 1
symmnumber: 1
zpe: 177151.0 jmol-1
zpe.correction: 0.067473 hartree
zpe.thermalcorrener: 0.076386 hartree
zpe.thermalcorrenthalpy: 0.077330 hartree
zpe.thermalcorrgfe: 0.031274 hartree
zpe.sumelectzpe: -924.302804 hartree
zpe.sumelectthermal: -924.293892 hartree
zpe.sumelectthermalent: -924.292948 hartree
zpe.sumelectthermalfe: -924.339004 hartree
dipole: 2.6641 -1.9121 -0.0002
dipole: 3.2792
quadrupole: -78.0085 -87.6648 -77.3282
quadrupole: 1.2604 0.0174 0.0061
quadrupole: 2.9920 -6.6643 3.6723 1.2604 0.0174 0.0061
hfenergy: -924.3702775 hartree
pointgroup: C01 [X(C5H2Br1Cl1N2O2)]
dipole: 1.2788835 0.1700539 0.000009 debye
dipolederiv: -0.437475 0.4073613 0.0004978 0.4048716 -0.2681246 -0.0002392 0.0006653 -0.0003907 0.0398888 -0.7054781 0.3214257 0.0001669 0.3929202 -0.2661259 -0.0001223 0.0001314 -0.0001225 -0.0259572 -0.4802378 -0.0947298 -0.0005379 -0.0374757 -0.8700768 0.0018138 -0.0003984 0.0013751 -0.2204095 -0.6982962 0.0114764 -0.0016251 -0.0084109 -0.4250075 0.0009248 -0.0010794 0.0012485 -0.1863486 1.2754764 0.395223 0.0026173 0.208193 1.3165766 -0.0031632 0.0015618 -0.0028836 0.1930919 -0.9318067 0.3656925 0.0006279 -0.1942415 -0.2775463 0.0001323 0.0003582 -0.0001577 -0.1759177 -0.4808597 -0.1937899 -0.0002828 0.0278782 -0.3301877 0.0001876 -0.0000031 -0.000043 0.1194015 -0.0323038 0.275616 -0.0000051 0.0119727 -0.1138628 -0.000079 0.0004066 0.0002951 -0.0250778 1.210423 -0.8512193 -0.0011741 -0.3179971 0.6090385 0.0005102 -0.0012692 0.0004521 -0.0220136 0.9522274 -0.6471582 -0.0002099 -0.7930151 0.0875773 0.000074 0.0000995 0.0002855 -0.0387006 0.178243 0.0191346 -0.0001801 0.3048393 0.321301 0.0000314 -0.0000748 0.0001285 0.0219505 0.1595464 0.0064712 0.000053 0.033765 0.1191903 -0.0000635 -0.0002975 -0.0000755 0.1763137 -0.0094589 -0.0155036 0.0000521 -0.0332997 0.0972479 -0.000007 -0.0001004 -0.0001119 0.1437785 unknown
polarizability: 155.070993|-26.8196423|122.006066|0.0027128|-0.0113722|34.888413 unknown
InChI: InChI=1S/C5H2BrClN2O2/c6-5-4(9(10)11)1-3(7)2-8-5/h1-2H
charge 0 multiplicity 1
13 atoms
Br -1.938052 2.378181 0.001574
Cl 3.528033 -1.174179 -0.000509
O  -1.568768 -2.345826 0.003487
O  -2.855085 -0.466386 -0.004355
N  -1.719661 -1.062147 -0.000096
N  0.786569 1.827085 0.000293
C  -0.464769 -0.238371 0.000059
C  0.744242 -0.97552 -0.000087
C  -0.4010 1.185187 0.000359
C  1.960549 -0.278544 -0.000205
C  1.953169 1.134162 -0.000084
H  0.691416 -2.067193 -0.000087
H  2.880757 1.714651 -0.000249
