program: Gaussian 09
title: 000280701
version: EM64L-G09RevD.01
frameworkgroup: C1[X(C14H18N4)]
method: RPBEPBE
basis: SDD
operation: Freq
keyword: #pfreq=noraman
keyword: PBEPBE/SDD
title: #p freq=noraman PBEPBE/SDD
converged: YES YES NO NO
title: Mulliken charges:
elementType: N N N N C C C C C C C C C C C C C C H H H H H H H H H H H H H H H H H H
charge: -0.047247 -0.381195 -0.038815 -0.054534 0.198439 -0.460764 -0.460797 -0.419521 -0.419529 0.216013 0.218521 0.104332 0.110043 -0.618310 -0.783813 -0.782005 -0.330773 -0.339508 0.244145 0.210969 0.210978 0.244152 0.223759 0.218914 0.218919 0.223776 0.317258 0.221797 0.196090 0.221799 0.240229 0.287522 0.240244 0.240186 0.240193 0.288534
chargesum: 0.00000
title: Mulliken charges with hydrogens summed into heavy atoms:
elementType: N N N N C C C C C C C C C C C C C C
charge: -0.047247 -0.063937 -0.038815 -0.054534 0.198439 -0.005650 -0.005667 0.023152 0.023166 0.216013 0.218521 0.104332 0.110043 0.021376 -0.015818 -0.013092 -0.330773 -0.339508
polarizability: 2.12611429e+02 3.84717820e+00 2.00237509e+02 5.22991034e-03 -4.17126158e-03 1.15163823e+02
1716.lowfreq: -12.6468 -0.0009 -0.0002 0.0004 6.2132 10.1885 12.8781 60.9216 63.9265
frequency: -7.3286 60.9214 63.8885 85.9971 102.0658 129.8730 130.8964 150.7676 157.4444 194.9915 196.7300 215.4550 241.8567 252.6813 286.4750 291.2185 316.1938 340.5853 369.3156 392.4996 403.3311 415.0009 429.6589 474.2756 482.6259 501.3649 505.7481 542.9023 545.4684 578.1002 640.2986 645.0647 659.7646 668.2413 737.6735 797.0299 825.0999 852.2363 922.1385 951.5572 990.9031 1004.2313 1026.7072 1037.9716 1044.6467 1044.9597 1046.2723 1063.4550 1078.5015 1113.8578 1124.0759 1131.2150 1139.6010 1188.6408 1199.6823 1203.3649 1213.0010 1283.0840 1285.5141 1288.9951 1308.7162 1321.1480 1333.7329 1355.2467 1358.3297 1380.0674 1404.4379 1407.7826 1432.3157 1440.6391 1451.4952 1453.5371 1462.2914 1463.1810 1473.6604 1474.6165 1475.3517 1488.6483 1492.3361 1501.0633 1624.7526 1656.8917 2137.9719 2145.6422 2863.9321 2889.7263 2899.4751 2978.6630 2979.1866 2986.8737 2989.5418 3013.2499 3017.0850 3018.6226 3051.6204 3051.8225 3052.2042 3054.9477 3074.6050 3122.4952 3126.3697 3565.8652
redmass: 6.7921 3.6804 1.0671 2.3538 1.3604 2.9060 10.3005 2.8154 7.7955 4.2256 3.6905 1.2284 4.2920 1.9314 2.8954 2.5366 3.9973 2.2879 1.9241 5.0443 6.1086 3.8842 4.0361 5.3941 3.2559 7.7385 1.3698 3.2190 3.4585 2.7720 3.8435 7.1562 5.2027 6.9836 3.3913 1.5635 3.5246 4.0150 2.2339 1.7701 2.1445 3.4700 1.5907 2.0366 1.8268 1.5099 1.4918 1.6414 2.3025 1.8726 4.9716 2.7705 2.6368 1.1616 6.3736 1.7137 3.7103 1.7018 1.8322 1.5621 2.0173 4.0081 1.2696 1.3066 1.3866 1.3623 1.2382 1.2761 1.1864 1.0839 1.1756 1.1887 1.0530 1.0744 1.0438 1.0441 1.0637 1.0635 1.1096 1.8698 4.3006 7.5176 12.6145 12.6227 1.0558 1.0700 1.0680 1.0399 1.0399 1.0606 1.0619 1.0869 1.0762 1.0860 1.0993 1.0997 1.0993 1.1026 1.1010 1.0963 1.0959 1.0778
irintensity: 8.1388 0.8683 0.0464 0.0754 0.0222 0.0040 9.2341 0.0042 2.7276 4.0126 3.1278 0.0068 0.5949 0.9979 1.6705 4.4583 0.0012 0.8069 5.5271 0.5292 0.3984 2.5732 1.3001 0.0386 0.0054 0.4972 64.7553 21.7847 1.1800 0.3840 0.0067 0.0057 0.3232 0.6240 6.3155 1.2129 0.4773 0.7152 0.1325 4.0831 28.7428 4.5784 2.8004 10.6146 0.2050 6.7346 1.6872 13.6111 6.4628 3.1757 0.5191 5.2039 21.8986 2.2945 9.5468 6.9372 6.2640 24.2422 13.6906 6.5672 3.3941 20.3285 0.0739 1.7701 3.4844 8.7248 40.9763 18.1626 4.5006 9.4724 66.2975 169.1962 16.8557 19.2668 16.8873 15.5088 2.4078 7.4057 42.7737 216.9399 45.3059 110.7596 81.7892 54.6198 96.0753 41.2426 92.5056 4.4135 47.6051 10.6320 22.6226 66.9594 23.2989 56.7366 0.1531 1.6148 41.2073 29.7762 34.5857 3.4409 2.7584 63.9360
temp: 298.150 k
press: 1.00000 atm
elementType: 7 7 7 7 6 6 6 6 6 6 6 6 6 6 6 6 6 6 1 1 1 1 1 1 1 1 1 1 1 1 1 1 1 1 1 1
symmnumber: 1
zpe: 776653.1 jmol-1
zpe.correction: 0.295812 hartree
zpe.thermalcorrener: 0.313264 hartree
zpe.thermalcorrenthalpy: 0.314209 hartree
zpe.thermalcorrgfe: 0.251969 hartree
zpe.sumelectzpe: -761.915458 hartree
zpe.sumelectthermal: -761.898005 hartree
zpe.sumelectthermalent: -761.897061 hartree
zpe.sumelectthermalfe: -761.959300 hartree
dipole: -5.8489 3.1320 0.0004
dipole: 6.6347
quadrupole: -85.0458 -134.5846 -105.4736
quadrupole: -15.0513 0.0024 0.0017
quadrupole: 23.3222 -26.2166 2.8944 -15.0513 0.0024 0.0017
hfenergy: -762.2112697 hartree
pointgroup: C01 [X(C14H18N4)]
dipole: 2.1749253 -1.4433813 0.0001428 debye
polarizability: 213.2228663|2.6193593|199.6260711|-0.004814|0.0046451|115.1638234 unknown
InChI: InChI=1S/C14H18N4/c1-10-12(8-15)14(4-6-18(3)7-5-14)13(9-16)11(2)17-10/h17H,4-7H2,1-3H3
charge 0 multiplicity 1
36 atoms
N  -2.93983 1.017694 0.001507
N  2.610136 -1.099924 0.000621
N  1.357396 3.579758 0.000582
N  -1.825844 -2.968986 0.00023
C  -0.027828 0.242806 0.000738
C  -0.818847 0.714232 1.272659
C  -0.819375 0.714707 -1.270676
C  -2.336224 0.441307 1.226699
C  -2.336749 0.441855 -1.224202
C  1.358421 0.947825 0.000607
C  0.204634 -1.294283 0.000431
C  2.576092 0.297775 0.000621
C  1.456589 -1.888446 0.000449
C  -4.411287 0.900798 0.001792
C  3.925861 0.976398 0.000597
C  1.712698 -3.3786 0.000249
C  1.361871 2.379911 0.000597
C  -0.91611 -2.185538 0.000182
H  -0.6832 1.809214 1.359863
H  -0.37824 0.249177 2.174655
H  -0.379175 0.249957 -2.173027
H  -0.683713 1.809711 -1.357555
H  -2.547272 -0.651772 1.316719
H  -2.803824 0.930108 2.102845
H  -2.804674 0.931106 -2.099924
H  -2.547915 -0.651159 -1.314655
H  3.517501 -1.565515 0.000619
H  -4.823241 1.40209 0.896193
H  -4.770295 -0.159325 0.001616
H  -4.823623 1.402514 -0.892194
H  4.512788 0.690812 0.894724
H  3.816395 2.070346 0.00074
H  4.512647 0.691034 -0.893693
H  2.292529 -3.678356 0.89436
H  2.292523 -3.67812 -0.893945
H  0.770886 -3.944914 0.000176
