program: Gaussian 09
title: 000280702
version: EM64L-G09RevD.01
frameworkgroup: C1[X(C15H17NO5)]
method: RPBEPBE
basis: SDD
operation: Freq
keyword: #p
keyword: freq=noraman
keyword: PBEPBE/SDD
title: #p freq=noraman PBEPBE/SDD
converged: YES YES NO NO
title: Mulliken charges:
elementType: O O O O O N C C C C C C C C C C C C C C C H H H H H H H H H H H H H H H H H
charge: -0.260981 -0.455367 -0.227708 -0.429015 -0.233178 -0.082732 -0.042394 -0.460396 -0.443936 -0.536360 -0.543964 -0.362366 0.204800 0.152812 0.217438 0.138992 -0.341811 -0.330030 -0.217260 -0.217508 0.105129 0.227024 0.210406 0.272381 0.205613 0.222460 0.238438 0.256130 0.223761 0.269947 0.222454 0.249687 0.362802 0.262393 0.275213 0.239609 0.240142 0.387375
chargesum: 0.00000
title: Mulliken charges with hydrogens summed into heavy atoms:
elementType: O O O O O N C C C C C C C C C C C C C C C
charge: -0.260981 -0.092565 -0.227708 -0.041640 -0.233178 -0.082732 0.184630 0.022391 -0.015863 -0.041792 -0.050256 0.109775 0.204800 0.152812 0.217438 0.138992 -0.079418 -0.054817 0.022348 0.022634 0.105129
polarizability: 2.63806043e+02 1.38637528e+01 1.91341528e+02 -5.37121372e+00 3.90303192e-01 1.07676766e+02
1716.lowfreq: -5.0057 -3.9087 -0.0005 -0.0003 0.0004 7.4394 17.6127 26.4424 38.4823
frequency: 16.7777 26.3326 38.4310 55.4173 63.0533 80.1932 104.5562 122.9972 137.8744 171.6440 174.4363 205.7733 261.7704 264.3544 280.8728 303.0076 317.2331 333.7039 367.0029 377.5450 396.2074 403.3503 413.4432 424.3852 479.6296 522.9213 525.4667 552.1691 582.7114 594.2643 598.5711 647.1242 672.8028 680.7272 703.7866 740.1568 752.9848 775.7737 780.9010 787.4441 790.3958 793.9656 851.9268 893.2252 904.4380 905.7370 946.0257 961.9013 970.9892 975.4039 993.1576 1003.4189 1005.0461 1035.1047 1046.7902 1057.4041 1099.8816 1109.7319 1119.5438 1138.6041 1156.5703 1161.7512 1178.8881 1191.2885 1228.0031 1236.1432 1246.5962 1257.3954 1275.3563 1282.9324 1305.7986 1316.5310 1319.6381 1326.4311 1341.2263 1352.4497 1364.1644 1372.8896 1381.2469 1427.0499 1455.9990 1463.3992 1463.8732 1477.6187 1479.6838 1487.2856 1583.5169 1598.6501 1618.7750 1623.8953 1645.5248 2971.8574 2974.9104 2982.4073 2987.8265 2999.5533 3023.2219 3038.6547 3063.9273 3070.7535 3083.3839 3094.8936 3140.1636 3156.8088 3171.7335 3181.8412 3526.1959 3575.5298
redmass: 5.4014 6.2903 7.5008 6.7330 4.6290 6.2892 4.1999 4.2707 6.9708 8.7056 4.9858 4.2815 3.0420 4.4900 5.4158 3.6556 3.0868 7.6243 1.7672 2.1386 5.1232 3.1992 1.6050 2.8415 3.5784 3.7272 4.1346 3.8531 4.7101 1.4189 3.7024 5.1328 3.0195 4.1081 3.7874 5.4624 3.1776 3.1169 1.6130 2.3701 2.2907 3.7473 6.2072 3.1696 2.0326 2.0855 1.7632 2.0348 2.0435 1.4188 2.2161 3.0287 1.6743 3.6812 2.3412 2.3553 1.2141 1.9492 1.7591 1.6638 1.4701 1.7819 1.0684 1.3180 1.3829 3.0122 1.3295 1.3611 1.4610 1.4494 1.2475 1.6081 2.5685 1.5067 1.4805 1.3926 1.5775 1.4093 10.8761 2.1409 1.0937 1.0867 1.0883 1.7978 1.3564 1.0840 7.1997 6.5229 7.1487 9.6647 9.1891 1.0682 1.0673 1.0668 1.0662 1.0759 1.0576 1.1000 1.0965 1.0972 1.0928 1.1079 1.0865 1.0915 1.0957 1.0983 1.0641 1.0674
irintensity: 0.0245 0.1341 2.2687 1.2277 0.1601 1.2731 0.0782 1.0606 1.7702 0.2548 2.0638 0.6945 1.1415 0.6654 1.9578 5.1317 11.9763 8.1136 34.3221 21.3956 12.7858 14.1474 77.0813 9.9919 10.1803 10.1878 14.9545 4.9167 21.5487 81.5013 45.5693 11.0200 6.3936 13.6419 88.0296 9.6312 1.5280 34.1675 2.9200 3.5409 29.3003 14.3433 153.4857 22.2154 1.6852 25.1771 10.7787 14.7589 9.4288 18.4986 12.6373 234.6494 80.8578 63.0165 32.6301 43.3127 1.8908 12.7570 123.8729 8.1188 2.9179 84.7548 0.1135 22.7840 13.3503 259.3179 25.8390 10.5772 4.3899 6.1959 20.4564 2.6895 74.5449 2.5071 0.2510 0.7808 8.8759 5.6416 11.7098 2.9441 16.2589 19.0094 3.1839 13.4551 16.1279 10.1559 16.5111 42.6883 5.4489 124.7990 280.8177 14.4923 17.0026 22.5334 15.2795 65.8947 30.6049 44.1671 7.8947 17.7842 10.1908 15.7796 2.1828 12.9101 7.5372 10.6380 45.1900 39.0835
temp: 298.150 k
press: 1.00000 atm
elementType: 8 8 8 8 8 7 6 6 6 6 6 6 6 6 6 6 6 6 6 6 6 1 1 1 1 1 1 1 1 1 1 1 1 1 1 1 1 1
symmnumber: 1
zpe: 783582.3 jmol-1
zpe.correction: 0.298451 hartree
zpe.thermalcorrener: 0.318054 hartree
zpe.thermalcorrenthalpy: 0.318998 hartree
zpe.thermalcorrgfe: 0.248335 hartree
zpe.sumelectzpe: -1011.077791 hartree
zpe.sumelectthermal: -1011.058187 hartree
zpe.sumelectthermalent: -1011.057243 hartree
zpe.sumelectthermalfe: -1011.127906 hartree
dipole: -3.3118 -2.0508 1.2283
dipole: 4.0844
quadrupole: -104.5887 -107.0598 -128.0487
quadrupole: -0.8106 -0.7325 3.2279
quadrupole: 8.6437 6.1726 -14.8163 -0.8106 -0.7325 3.2279
hfenergy: -1011.3762413 hartree
pointgroup: C01 [X(C15H17N1O5)]
dipole: -1.3087116 0.791083 -0.4936406 debye
polarizability: 263.8831881|-11.8286243|189.9114089|12.3280199|5.9139336|109.0297397 unknown
InChI: InChI=1S/C15H17NO5/c17-14(18)12-3-1-2-4-13(12)15(19)21-9-10-5-7-11(16-20)8-6-10/h1-4,10,17,20H,5-9H2
charge 0 multiplicity 1
38 atoms
O  -0.307287 1.568653 -0.066075
O  6.319892 -0.769747 0.671929
O  -0.434483 -0.274863 1.37093
O  -2.911977 -3.217153 -0.379816
O  -0.98847 -2.046066 -0.936234
N  5.013263 -1.391877 0.329505
C  2.05041 1.360936 -0.847977
C  2.006806 -0.162858 -1.139851
C  3.509556 1.810999 -0.552906
C  2.660537 -1.010908 -0.014709
C  4.192471 0.989679 0.578871
C  1.124817 1.793363 0.306162
C  4.04852 -0.498363 0.320591
C  -0.957676 0.485728 0.524516
C  -2.391158 0.416474 0.075612
C  -3.006425 -0.819109 -0.281693
C  -3.179716 1.588416 0.149169
C  -4.403835 -0.865453 -0.510374
C  -4.570122 1.536453 -0.095059
C  -5.185921 0.305002 -0.411723
C  -2.17955 -2.033411 -0.549404
H  1.700824 1.897251 -1.753435
H  2.552338 -0.343192 -2.087321
H  0.970264 -0.509897 -1.295838
H  3.539665 2.888302 -0.294231
H  4.101494 1.688759 -1.48044
H  2.717227 -2.07112 -0.315487
H  2.018306 -0.966865 0.887651
H  3.721065 1.225253 1.555196
H  5.2586 1.256491 0.661115
H  1.194062 2.881815 0.474398
H  1.329013 1.251065 1.245209
H  6.924371 -1.553361 0.620881
H  -2.697967 2.534848 0.41157
H  -4.860587 -1.82158 -0.779589
H  -5.16818 2.451547 -0.030195
H  -6.264776 0.257535 -0.592217
H  -2.325867 -3.990144 -0.601631
