program: Gaussian 09
title: 000025244
version: EM64L-G09RevD.01
frameworkgroup: C1[X(C11H15N)]
method: RPBEPBE
basis: SDD
operation: Freq
keyword: #pfreq=noraman
keyword: PBEPBE/SDD
title: #p freq=noraman PBEPBE/SDD
converged: YES YES NO NO
title: Mulliken charges:
elementType: N C C C C C C C C C C C H H H H H H H H H H H H H H H
charge: -0.631122 -0.234458 -0.446141 -0.365993 -0.389088 -0.548569 0.378523 0.344353 -0.463072 -0.439450 -0.246326 -0.243691 0.188954 0.215313 0.197506 0.189504 0.203136 0.204155 0.197102 0.194961 0.239020 0.231450 0.231430 0.268298 0.275194 0.224698 0.224312
chargesum: 0.00000
title: Mulliken charges with hydrogens summed into heavy atoms:
elementType: N C C C C C C C C C C C
charge: -0.087630 -0.045504 -0.033322 0.026647 0.012170 -0.114587 0.378523 0.344353 -0.231622 -0.208021 -0.021628 -0.019379
polarizability: 1.50219894e+02 -3.29758627e-01 1.22487952e+02 5.04380546e+00 7.72786050e+00 8.30411037e+01
1716.lowfreq: -7.4413 -0.0006 -0.0005 -0.0003 10.0353 14.9905 90.4556 117.0536 170.6637
frequency: 90.4363 117.0425 170.6540 214.7598 252.4671 283.6611 306.9212 336.1942 341.6389 359.9330 436.5047 471.1654 539.4403 553.1031 575.6437 595.7151 676.3213 711.7121 755.5252 769.4248 788.1657 798.9005 857.9764 870.8425 896.7015 918.6312 944.3606 951.6679 985.9668 1005.8026 1026.5294 1048.7990 1081.6535 1096.2426 1120.3540 1149.5873 1160.9540 1172.7964 1192.3915 1218.8037 1226.5250 1256.6196 1263.1559 1293.1766 1315.1376 1334.3896 1347.5829 1358.1876 1365.4469 1373.0725 1397.4729 1440.6002 1451.3770 1455.8580 1462.7937 1466.3496 1487.1642 1589.1801 1609.4677 1632.6924 2853.6077 2956.8952 2965.1940 2979.8604 2982.7168 3017.6359 3023.2207 3039.7976 3045.5722 3105.4990 3113.3496 3133.6020 3156.7678 3440.1211 3572.7649
redmass: 3.3718 3.2544 3.1181 2.4628 1.4358 1.8980 2.8374 3.2691 3.1448 2.1936 1.9438 3.4738 2.3173 3.6837 2.4473 1.8840 3.5251 2.7341 1.7009 2.1641 2.2589 2.4825 2.5868 1.3484 1.6862 2.5519 2.0036 1.6192 1.3312 2.1154 1.9996 2.1543 2.0883 2.2669 1.6652 1.5014 1.6080 1.0705 1.2816 1.8345 1.4947 1.3601 1.2491 1.3742 1.3928 1.4061 1.3535 1.4340 1.5709 2.5679 1.9277 2.1645 1.1226 1.0908 1.1173 1.1056 2.3769 6.3134 5.9692 1.1146 1.0817 1.0632 1.0604 1.0627 1.0613 1.0986 1.0993 1.1004 1.1009 1.0873 1.0881 1.0922 1.1005 1.0445 1.0977
irintensity: 0.5880 0.2677 3.3211 0.7633 25.6854 17.0228 1.2332 8.4651 7.9801 3.0444 3.6122 3.4140 6.6804 4.5642 39.2343 76.5577 21.4957 37.4141 49.3684 27.1279 3.0276 1.6581 1.8420 1.6510 1.2612 5.6016 7.7786 1.3617 0.1494 9.8245 3.5749 10.9556 3.4403 3.8717 2.0296 1.6300 5.3572 0.1372 2.3927 0.3787 6.0018 1.4630 0.2776 6.0438 8.6497 3.4890 1.3562 2.8030 5.0865 2.0501 4.7231 4.5331 10.3342 13.3011 15.0962 8.9907 17.4779 1.4321 3.4771 52.8690 82.4287 34.4935 44.5235 86.4089 31.6940 46.4516 29.6038 41.5496 53.9878 15.3304 4.6773 30.9268 36.0889 2.4337 0.2447
temp: 298.150 k
press: 1.00000 atm
elementType: 7 6 6 6 6 6 6 6 6 6 6 6 1 1 1 1 1 1 1 1 1 1 1 1 1 1 1
symmnumber: 1
zpe: 618219.6 jmol-1
zpe.correction: 0.235467 hartree
zpe.thermalcorrener: 0.245932 hartree
zpe.thermalcorrenthalpy: 0.246876 hartree
zpe.thermalcorrgfe: 0.200258 hartree
zpe.sumelectzpe: -482.017836 hartree
zpe.sumelectthermal: -482.007371 hartree
zpe.sumelectthermalent: -482.006427 hartree
zpe.sumelectthermalfe: -482.053045 hartree
dipole: 0.7191 -1.1215 0.1054
dipole: 1.3364
quadrupole: -68.1131 -66.0198 -74.4767
quadrupole: -2.4755 0.8642 -0.8805
quadrupole: 1.4235 3.5167 -4.9402 -2.4755 0.8642 -0.8805
hfenergy: -482.253303 hartree
pointgroup: C01[X(C11H15N1)]
dipole: -0.2803453 0.44365 0.0321378 debye
polarizability: 150.1701916|-0.640163|122.1043539|-5.3626345|-8.625712|83.4744046 unknown
InChI: InChI=1S/C11H15N/c12-11-8-4-2-6-9-5-1-3-7-10(9)11/h1,3,5,7,11H,2,4,6,8,12H2
charge 0 multiplicity 1
27 atoms
N  -1.489115 1.48736 1.386064
C  -0.958771 1.420237 0.000315
C  -2.041518 0.843259 -0.958526
C  -2.736296 -0.463459 -0.510958
C  -1.812435 -1.696822 -0.387061
C  -0.733168 -1.564048 0.72502
C  0.369036 0.654057 -0.020254
C  0.475237 -0.728082 0.327926
C  1.536935 1.362318 -0.396643
C  1.754034 -1.338955 0.284028
C  2.805294 0.740179 -0.43858
C  2.91343 -0.62367 -0.093407
H  -0.727686 2.439119 -0.399512
H  -1.571596 0.700296 -1.951443
H  -2.823224 1.621647 -1.090863
H  -3.544408 -0.688202 -1.236873
H  -3.224288 -0.293845 0.468602
H  -1.322437 -1.906204 -1.359544
H  -2.443652 -2.577764 -0.153604
H  -0.384461 -2.57514 1.009408
H  -1.216496 -1.10954 1.611051
H  1.447608 2.424167 -0.660881
H  1.83853 -2.400227 0.549583
H  -2.399207 1.956057 1.455976
H  -0.812527 1.853442 2.063529
H  3.691871 1.312238 -0.734189
H  3.886708 -1.127117 -0.116965
