program: Gaussian 09
title: 000280679
version: EM64L-G09RevD.01
frameworkgroup: C1[X(C11H19NO2)]
method: RPBEPBE
basis: SDD
operation: Freq
keyword: #p
keyword: freq=noraman
keyword: PBEPBE/SDD
title: #p freq=noraman PBEPBE/SDD
converged: NO YES NO NO
title: Mulliken charges:
elementType: O O N C C C C C C C C C C C H H H H H H H H H H H H H H H H H H H
charge: -0.274714 -0.197198 -0.008397 -0.057406 0.246192 -0.391314 -0.430342 -0.767994 0.148827 -0.716090 -0.715171 -0.248193 -0.259532 -0.664170 0.226496 0.226836 0.230676 0.220688 0.229560 0.240914 0.223378 0.227287 0.230056 0.247331 0.219002 0.209210 0.223013 0.218741 0.237493 0.224285 0.222270 0.225923 0.252344
chargesum: 0.00000
title: Mulliken charges with hydrogens summed into heavy atoms:
elementType: O O N C C C C C C C C C C C
charge: -0.274714 -0.197198 -0.008397 0.169089 0.246192 0.058934 0.027170 -0.076415 0.148827 -0.019701 -0.064207 -0.248193 0.202246 0.036366
polarizability: 1.37728220e+02 -4.34361662e+00 1.27560256e+02 -3.85723670e+00 5.30855968e+00 1.16466591e+02
1716.lowfreq: -22.5601 -14.5485 -0.0008 -0.0005 -0.0004 8.5801 29.7393 48.1510 56.7504
frequency: 26.4963 47.9391 56.3921 74.7012 80.5351 102.1336 111.9820 136.8051 150.2053 162.6935 178.3998 193.8643 220.9786 235.7514 255.6322 291.8115 316.8927 322.4852 331.6330 377.1757 403.5710 419.9617 451.8153 467.2201 575.7593 646.3742 696.7238 720.6484 768.8345 772.6453 810.4644 816.9694 835.0082 926.4008 942.8721 950.0268 973.5867 996.5824 1012.7780 1042.4974 1062.2268 1080.0458 1088.9140 1097.0151 1112.5330 1151.7365 1156.2467 1170.5234 1202.7460 1259.9712 1273.3493 1277.0735 1311.9016 1320.6571 1331.5456 1351.0793 1353.7414 1389.1412 1390.1057 1397.4635 1402.1199 1454.9013 1458.5154 1463.2048 1463.9956 1474.7410 1478.7628 1479.4656 1481.7527 1485.1352 1485.3694 1495.5776 1634.0539 2193.9286 2974.7498 2980.3880 2985.9354 2987.9207 2993.0578 2999.0186 3012.1081 3028.9329 3030.2640 3065.8496 3073.2628 3080.4362 3082.4154 3084.1195 3087.2742 3088.2164 3092.5574 3093.3885 3119.6744
redmass: 3.1010 2.1520 2.3927 3.4006 5.7418 2.6423 3.9451 3.6753 4.0277 2.5525 1.2542 1.4477 1.2538 1.3150 1.7014 2.4569 2.7419 2.8152 2.8660 3.9140 4.2391 5.0189 2.8852 4.5211 4.8154 3.5087 5.1682 3.0622 1.3023 1.4762 1.3610 2.4528 2.1455 2.4271 1.8541 2.4567 1.2470 1.8793 2.6755 2.9141 1.9851 2.9485 2.5551 2.1769 2.6404 2.0963 1.9216 2.2416 2.7102 1.2538 1.2113 1.1171 1.3557 1.3565 1.3000 1.3904 1.2917 1.2303 1.2224 1.1976 1.2048 1.0920 1.0741 1.0442 1.0729 1.0441 1.0462 1.0587 1.0511 1.0519 1.0511 1.0448 10.3935 12.6425 1.0595 1.0372 1.0360 1.0379 1.0359 1.0840 1.0598 1.0999 1.0595 1.1010 1.0991 1.0997 1.0994 1.0986 1.0986 1.0975 1.1016 1.1032 1.1065
irintensity: 0.2495 0.5583 0.4222 0.0798 0.4336 0.2282 1.4517 2.4610 2.1302 2.1015 0.7524 0.7615 1.2535 0.0630 0.5050 1.6816 8.2934 0.2503 0.5854 4.8390 0.3220 5.6303 2.2461 0.6232 3.7051 5.2226 4.6572 5.9793 1.5726 10.6725 5.6893 2.5000 0.1629 10.2199 8.9482 6.2545 3.4397 0.9894 45.3176 14.8991 47.6516 1.5582 209.0577 18.4264 61.7577 7.1907 9.5750 11.0477 46.5244 2.3193 2.1431 4.0280 1.5461 4.5904 0.2038 2.4783 0.5795 21.5547 14.3677 20.7082 18.8681 9.3741 6.2520 18.5970 2.0080 13.5414 5.6252 5.0311 5.0840 19.4840 18.7255 7.1940 136.1753 4.2887 27.4699 29.6346 22.1838 18.4970 15.7610 4.9376 18.4044 15.6159 27.0304 2.1232 37.8903 27.7901 15.9829 67.4249 52.8741 32.8933 24.8522 1.0581 27.9226
temp: 298.150 k
press: 1.00000 atm
elementType: 8 8 7 6 6 6 6 6 6 6 6 6 6 6 1 1 1 1 1 1 1 1 1 1 1 1 1 1 1 1 1 1 1
symmnumber: 1
zpe: 735669.6 jmol-1
zpe.correction: 0.280202 hartree
zpe.thermalcorrener: 0.297827 hartree
zpe.thermalcorrenthalpy: 0.298772 hartree
zpe.thermalcorrgfe: 0.234281 hartree
zpe.sumelectzpe: -634.637956 hartree
zpe.sumelectthermal: -634.620330 hartree
zpe.sumelectthermalent: -634.619386 hartree
zpe.sumelectthermalfe: -634.683876 hartree
dipole: 1.9417 -2.9302 -4.6066
dipole: 5.7946
quadrupole: -79.3631 -86.2892 -95.9734
quadrupole: 1.3275 1.8532 -8.0252
quadrupole: 7.8455 0.9193 -8.7648 1.3275 1.8532 -8.0252
hfenergy: -634.9181574 hartree
pointgroup: C01 [X(C11H19N1O2)]
dipole: 1.132884 -1.2900062 -1.4999132 debye
polarizability: 139.6871201|-2.1644875|127.3192181|-3.6283783|1.2951125|114.7487282 unknown
InChI: InChI=1S/C11H19NO2/c1-5-9(4)11(6-2,8-12)10(13)14-7-3/h9H,5-7H2,1-4H3
charge 0 multiplicity 1
33 atoms
O  1.689542 -0.693183 -0.41032
O  1.224719 0.514578 1.528575
N  -2.028467 1.921705 1.199099
C  -1.201856 -1.002091 -0.594434
C  -0.460903 0.380774 -0.320699
C  -1.383659 -1.804189 0.724447
C  -0.1625 1.152182 -1.659569
C  -2.544216 -0.79755 -1.332531
C  0.882046 0.103755 0.40083
C  0.660154 2.442907 -1.472264
C  -1.886486 -3.248635 0.511126
C  -1.301997 1.233196 0.551196
C  3.044512 -1.038215 0.131024
C  4.048818 0.079745 -0.158726
H  -0.511178 -1.568439 -1.25097
H  -1.1282 1.40146 -2.132595
H  0.370065 0.449755 -2.326378
H  -0.415924 -1.848483 1.262164
H  -2.08235 -1.25911 1.389835
H  -3.243406 -0.190069 -0.728329
H  -2.413101 -0.303852 -2.310895
H  -3.024174 -1.772277 -1.525865
H  1.663527 2.232819 -1.059766
H  0.1526 3.147794 -0.789587
H  0.796559 2.950825 -2.443663
H  -1.230698 -3.800185 -0.189347
H  -1.89522 -3.800275 1.468593
H  -2.914016 -3.27535 0.107496
H  2.949061 -1.222182 1.215552
H  3.297222 -1.972627 -0.394694
H  5.057322 -0.236494 0.166398
H  4.09074 0.304131 -1.238671
H  3.784862 0.998078 0.391867
