program: Gaussian 09
title: 000280669
version: EM64L-G09RevD.01
frameworkgroup: C1[X(C12H6Cl2O2)]
method: RPBEPBE
basis: SDD
operation: Freq
keyword: #p
keyword: freq=noraman
keyword: PBEPBE/SDD
title: #p freq=noraman PBEPBE/SDD
converged: YES YES NO NO
title: Mulliken charges:
elementType: Cl Cl O O C C C C C C C C C C C C H H H H H H
charge: 0.001108 0.017546 -0.181268 -0.219111 0.504062 0.183092 -0.326544 -0.368154 -0.021218 0.054984 -0.374208 -0.267614 -0.252982 -0.092318 -0.225499 -0.105050 0.271231 0.266133 0.323779 0.274049 0.272582 0.265397
chargesum: 0.00000
title: Mulliken charges with hydrogens summed into heavy atoms:
elementType: Cl Cl O O C C C C C C C C C C C C
charge: 0.001108 0.017546 -0.181268 -0.219111 0.504062 0.183092 -0.055313 -0.102020 -0.021218 0.054984 -0.050428 0.006435 0.019600 -0.092318 0.039898 -0.105050
polarizability: 3.15468341e+02 -6.59969055e+00 1.67770506e+02 8.54452409e-03 6.77606054e-03 5.54737920e+01
1716.lowfreq: -2.1365 0.0006 0.0011 0.0023 2.1549 7.5699 39.9367 46.4942 94.0735
frequency: 39.9330 46.4927 94.0735 99.7596 138.8334 176.1393 180.8485 207.1600 216.3506 264.3800 292.5683 333.0551 381.1061 390.2807 433.7272 440.0502 489.5628 542.4797 579.5224 582.1616 643.8921 679.6361 687.6345 706.9115 708.8842 737.9426 742.6602 852.3143 867.4499 878.9010 887.4202 971.9425 991.9810 992.2149 1002.2846 1017.4364 1040.9130 1124.0344 1130.1158 1164.8000 1173.3561 1241.0155 1282.4227 1299.9339 1351.3718 1391.8460 1413.5753 1461.4362 1542.2115 1559.2072 1581.6799 1595.4118 1609.5684 1657.5251 3054.5107 3135.0372 3152.8772 3170.8514 3181.7460 3210.3743
redmass: 8.5179 9.2899 9.2024 8.3515 5.7629 24.2079 12.0444 7.6058 14.7478 4.1239 6.9354 9.2846 11.3149 3.4010 9.0157 3.0832 8.3748 5.0977 4.7203 8.5512 6.4822 8.0258 2.2864 3.5062 7.4617 4.1789 6.1030 1.3144 2.1886 5.9927 1.5312 1.3760 3.4724 1.5512 5.5059 1.3293 1.4530 2.3308 3.0901 2.1233 1.9501 1.6162 2.1917 1.8378 2.9378 3.7522 1.8559 2.6850 7.2039 7.2150 7.2799 8.6325 8.6480 9.0273 1.0867 1.0946 1.0926 1.0945 1.0890 1.1087
irintensity: 0.1842 0.2882 0.1104 10.0009 0.8546 0.1647 1.5856 2.1743 0.0866 0.0811 0.7404 3.1058 22.9889 1.7203 15.6619 8.3733 13.8443 6.0079 8.3384 7.8960 3.9443 6.1707 5.3263 6.3985 28.3932 1.1012 4.4978 24.1502 50.8982 18.8429 29.4974 0.4927 3.4107 9.3345 33.9223 5.9340 125.0827 102.6207 10.5066 167.9943 82.3372 0.0575 0.8780 5.0400 3.7627 13.1580 77.9870 125.7456 79.7920 93.5351 87.9574 436.8006 215.7975 174.5327 0.8028 49.0971 0.1754 5.8269 0.1333 7.1489
temp: 298.150 k
press: 1.00000 atm
elementType: 17 17 8 8 6 6 6 6 6 6 6 6 6 6 6 6 1 1 1 1 1 1
symmnumber: 1
zpe: 375769.8 jmol-1
zpe.correction: 0.143123 hartree
zpe.thermalcorrener: 0.156736 hartree
zpe.thermalcorrenthalpy: 0.157681 hartree
zpe.thermalcorrgfe: 0.101139 hartree
zpe.sumelectzpe: -1530.313860 hartree
zpe.sumelectthermal: -1530.300247 hartree
zpe.sumelectthermalent: -1530.299303 hartree
zpe.sumelectthermalfe: -1530.355845 hartree
dipole: -2.0364 -1.1385 -0.0028
dipole: 2.3331
quadrupole: -97.4481 -111.6079 -106.6545
quadrupole: 5.5617 0.0437 -0.0257
quadrupole: 7.7887 -6.3711 -1.4176 5.5617 0.0437 -0.0257
hfenergy: -1530.4569836 hartree
pointgroup: C01 [X(C12H6Cl2O2)]
dipole: 0.7370959 -0.3881523 -0.3854625 debye
dipolederiv: -0.3826602 0.2156107 0.2228582 0.2922074 -0.2233319 -0.2076693 0.3189017 -0.217843 -0.2571044 -0.9931853 -0.0297817 -0.1637165 -0.0882614 -0.0316085 -0.0303013 -0.2355612 -0.0226711 -0.0753865 -0.6437338 0.0062467 -0.0359262 -0.3986505 -0.5035097 -0.2901684 -0.5393769 -0.2367308 -0.6769988 -0.5629369 -0.1805468 -0.257584 0.1727426 -0.5295431 -0.2474823 0.1802974 -0.2939703 -0.6543567 -0.809343 0.0459968 -0.0486062 -0.1297515 0.0183611 0.0091719 -0.2662851 0.0321401 0.0024701 -1.8188083 0.2242615 0.0493429 0.5201256 -0.2995824 -0.2100421 0.4171907 -0.2489818 -0.3299539 1.6583613 -0.2126733 -0.0460063 -0.1564553 0.0765644 0.0822546 0.0235238 0.075014 0.0908187 0.1872724 0.1299363 0.1986505 -0.1019836 -0.0924925 -0.016824 -0.0910861 0.0135613 -0.0846999 1.5807031 -0.1880588 -0.0483912 0.4289411 0.4685057 0.4174306 0.7203766 0.3359275 0.6894207 1.1489597 0.1130139 0.2638514 -0.6556865 0.5776056 0.3607108 -0.6908724 0.4620751 0.701335 0.121063 -0.0303816 -0.009544 0.2357485 -0.1131413 0.0170218 0.3221243 -0.0182004 -0.0820253 -0.1219086 0.1781503 0.2196572 0.3410612 -0.2175676 -0.0916517 0.421527 -0.1130661 -0.1919796 -0.7080741 -0.0428747 -0.1305738 -0.1436633 0.0071039 0.1427265 -0.2563737 0.1560664 0.0366439 0.1556778 -0.4558045 -0.5440529 -0.6260168 0.284107 0.318983 -0.7563918 0.3418983 0.2910786 -0.5169065 0.0463294 0.0021148 0.1644226 -0.0506145 0.0658562 0.1506578 0.0500304 -0.003472 1.2642704 0.1635414 0.3717915 0.1648102 -0.0227407 0.0410675 0.3718074 0.0407207 0.0609439 0.088701 0.0005955 -0.0039333 0.0027043 0.0699485 -0.0686943 -0.0026139 -0.0690838 0.0387808 0.0724208 -0.0351988 -0.0551499 -0.0155721 0.105389 -0.0688427 -0.0309235 -0.0713629 0.0654893 0.2444475 0.0094657 0.0242025 -0.049699 0.1338741 -0.0347569 -0.0493249 -0.0265993 0.116347 -0.0498363 0.0176855 -0.0074783 -0.0002912 0.1431119 -0.0354695 -0.0300044 -0.0330291 0.1265854 0.0352372 0.0337033 0.0245323 0.0644238 0.1009604 -0.0716339 0.0628691 -0.075792 0.0798265 0.0502789 -0.0092168 -0.0260385 -0.0211561 0.0986007 -0.0816865 -0.040462 -0.0801033 0.0562372 unknown
polarizability: 313.0968937|-23.792392|101.7008677|4.1093049|54.4890527|123.9148781 unknown
InChI: InChI=1S/C12H6Cl2O2/c13-9-2-1-7(6-10(9)14)5-8-11(15)3-4-12(8)16/h1-6H
charge 0 multiplicity 1
22 atoms
Cl -4.149604 1.934863 1.688466
Cl -5.196095 0.051966 -0.796369
O  3.374607 1.151295 1.689476
O  1.51524 -1.531546 -1.891111
C  -0.661902 0.35685 0.169534
C  1.916102 -0.00817 0.054537
C  0.73925 0.51268 0.547879
C  -1.617794 1.079232 0.948115
C  3.220734 0.375609 0.705936
C  2.266958 -0.94212 -1.058209
C  -1.134009 -0.454922 -0.907894
C  4.31348 -0.339146 -0.035668
C  3.766662 -1.089147 -1.040095
C  -2.989795 0.995656 0.665708
C  -2.509554 -0.533456 -1.18416
C  -3.441356 0.187219 -0.402778
H  0.907939 1.184001 1.407991
H  -1.283775 1.709102 1.779474
H  -0.416895 -1.015699 -1.515746
H  5.367679 -0.237319 0.231448
H  4.282945 -1.726201 -1.761987
H  -2.87422 -1.154345 -2.007551
