program: Gaussian 09
title: 000280664
version: EM64L-G09RevD.01
frameworkgroup: C1[X(C10H8N2O4)]
method: RPBEPBE
basis: SDD
operation: Freq
keyword: #p
keyword: freq=noraman
keyword: PBEPBE/SDD
title: #p freq=noraman PBEPBE/SDD
converged: NO YES NO NO
title: Mulliken charges:
elementType: O O O O N N C C C C C C C C C C H H H H H H H H
charge: -0.153623 -0.391696 -0.185668 -0.197339 -0.227821 0.048954 -0.258452 0.051473 0.184504 0.023502 0.218506 0.190209 -0.273837 -0.175954 -0.783476 -0.317998 0.313324 0.278404 0.241709 0.266340 0.235065 0.270562 0.253852 0.389462
chargesum: 0.00000
title: Mulliken charges with hydrogens summed into heavy atoms:
elementType: O O O O N N C C C C C C C C C C
charge: -0.153623 -0.002234 -0.185668 -0.197339 -0.227821 0.048954 0.054872 0.051473 0.184504 0.023502 0.218506 0.190209 0.004567 0.065755 -0.011509 -0.064146
polarizability: 1.79260911e+02 1.18078838e+00 1.50157545e+02 1.05980931e+01 9.43969237e+00 7.61337316e+01
1716.lowfreq: -5.1611 0.0002 0.0003 0.0004 6.1232 9.9820 37.9686 49.2548 53.0201
frequency: 37.9513 49.1925 52.9957 84.1004 112.4019 137.8155 152.6815 173.9996 218.1034 263.9685 317.8519 346.4040 356.6007 387.6511 408.5991 504.2895 526.9106 538.1980 552.1481 561.4729 589.0807 595.2251 636.9579 663.8085 716.4288 777.2939 788.1131 807.4916 831.8967 889.3345 910.8482 956.2009 972.2466 987.9041 1022.1381 1026.5380 1033.8923 1044.1203 1078.0443 1151.7865 1163.6950 1188.7328 1231.8233 1236.8608 1285.4069 1310.3195 1322.2410 1355.2861 1381.9319 1402.4148 1444.0909 1454.5236 1470.7457 1547.6448 1593.2219 1639.7487 1648.1192 1670.5984 2994.7865 3061.1115 3083.3819 3133.2627 3139.7131 3158.3106 3181.7570 3519.4554
redmass: 8.8439 5.5739 5.5821 3.9105 3.3901 8.2332 1.3917 5.8271 6.4523 7.2600 7.4723 6.8819 4.4021 7.8712 4.5046 3.2532 2.7490 7.6524 4.2733 3.7558 3.3354 3.3256 2.2837 4.3982 7.5277 7.5981 2.1089 2.4597 4.7222 5.0443 5.7251 1.4320 3.5132 1.4012 2.6313 2.8380 1.6879 2.4361 1.9512 1.6222 2.5922 1.7782 2.2396 2.1433 2.2618 2.1015 5.4917 3.2391 1.2399 2.8651 2.2785 1.0771 1.0524 7.0306 7.4468 9.7116 11.4377 9.8127 1.0378 1.0849 1.0980 1.0985 1.0901 1.0913 1.0996 1.0644
irintensity: 5.3101 1.6303 1.2960 4.5879 0.2960 2.7084 0.3978 5.2880 0.5906 4.9381 0.2189 6.7612 6.5056 1.7767 0.6021 8.9689 28.3730 10.1107 19.4942 34.3732 15.5294 28.7736 57.9066 33.8736 3.3644 7.7379 44.7239 28.5432 3.5237 1.8055 28.1556 0.1534 131.7336 0.7505 4.7012 179.7404 9.9822 148.6441 7.0839 48.5802 4.6591 52.3839 2.7469 178.7325 132.4895 13.5704 16.4331 250.6514 89.6656 197.0857 67.4337 24.1430 27.9656 54.0390 148.2058 439.4298 218.8592 87.4418 3.8901 0.3307 8.8880 7.5666 11.7795 1.6989 15.5546 48.1215
temp: 298.150 k
press: 1.00000 atm
elementType: 8 8 8 8 7 7 6 6 6 6 6 6 6 6 6 6 1 1 1 1 1 1 1 1
symmnumber: 1
zpe: 441911.7 jmol-1
zpe.correction: 0.168315 hartree
zpe.thermalcorrener: 0.182372 hartree
zpe.thermalcorrenthalpy: 0.183317 hartree
zpe.thermalcorrgfe: 0.126143 hartree
zpe.sumelectzpe: -795.127657 hartree
zpe.sumelectthermal: -795.113600 hartree
zpe.sumelectthermalent: -795.112655 hartree
zpe.sumelectthermalfe: -795.169829 hartree
dipole: -0.3685 -2.2780 -0.7377
dipole: 2.4227
quadrupole: -63.3501 -109.2710 -95.2429
quadrupole: -4.9940 1.7555 -4.8979
quadrupole: 25.9380 -19.9830 -5.9549 -4.9940 1.7555 -4.8979
hfenergy: -795.2959721 hartree
pointgroup: C01 [X(C10H8N2O4)]
dipole: -0.1476469 -0.9027444 -0.2678927 debye
dipolederiv: -0.4832311 -0.1738391 -0.0543302 -0.1061411 -1.1728435 -0.2485335 -0.064849 -0.162909 -0.3241376 -1.0076156 -0.3722672 -0.2797992 -0.4475832 -0.5886484 -0.1495682 -0.185959 -0.1183636 -0.3256808 -0.4552544 -0.2357424 0.0055527 0.176038 -1.1244213 0.0880928 0.0014378 -0.0118355 -0.2914276 -0.5536802 -0.1044522 0.0883272 -0.1692686 -0.4054515 -0.071315 0.1260473 -0.2020907 -0.8823503 -1.3514165 0.867441 -0.1671906 0.6100745 -1.1259032 0.1456185 -0.1529713 0.1663178 -0.2353818 -0.9034567 0.2619526 -0.0966912 -0.2213851 -0.1001607 -0.0312228 -0.178682 0.0631092 -0.2274008 -0.4946862 0.3756457 0.2249084 0.4652908 0.0873755 -0.0926868 0.2954341 -0.0095304 0.0439315 1.4117206 -0.6793071 0.1963698 -0.119688 0.2654272 -0.0032557 0.2310269 -0.1002681 0.1975086 -0.8908765 -0.4833381 -0.178402 0.2127815 -0.5582563 -0.0545568 -0.1437053 -0.1445742 -0.0438062 1.2390006 0.398484 0.1159059 -0.1295647 1.3685633 0.4168152 0.2109575 0.2921598 0.1812257 1.1436873 -0.3446631 0.1173754 -0.7299705 2.0117468 -0.2118666 0.0520265 -0.079101 0.1900913 1.4266962 0.5234102 -0.0567245 0.7079588 0.5354194 0.1931029 -0.3050892 0.2840069 1.1697115 0.4501049 0.2625039 0.1248883 -0.1124005 0.2280854 0.0300943 0.0694373 0.076609 -0.0283406 -0.1261144 -0.0872067 0.0022443 -0.2742791 -0.5479739 -0.0983877 -0.0333394 -0.0877842 -0.1493704 -0.4626038 0.0981652 -0.0415621 0.0017768 -0.0562264 0.0308547 0.0009717 0.0298376 0.0254847 0.429226 -0.2151044 0.075167 0.1683995 0.5227663 0.1029753 0.1317546 0.0193877 -0.0043527 0.0855978 -0.0210569 -0.0580425 -0.0272618 0.0748349 0.0225247 -0.035096 0.0055758 0.0290842 0.1063766 0.001927 -0.0117149 0.0482576 -0.0107156 -0.0107683 0.0016406 -0.0137284 0.144075 -0.0753746 0.0418061 -0.0420163 0.0532079 0.0850781 0.0016132 -0.042563 0.0015629 0.1636925 0.0517872 -0.0307019 0.0223788 -0.0417812 0.1286675 0.0549174 0.050173 0.0440951 -0.0256005 0.0575787 -0.0185236 -0.0119422 -0.0513309 0.0305665 -0.1291828 -0.0517049 -0.0998858 0.0172827 0.0903814 0.0073395 -0.0087108 0.0786117 -0.0569707 0.0503135 -0.0287269 0.042741 0.1191535 -0.0341199 -0.0640817 -0.0408179 -0.0945684 0.0399976 -0.0311411 -0.047944 -0.0178802 0.1125427 0.3462727 -0.0083911 0.0748263 0.0028259 0.3690429 -0.0044372 0.0997227 0.0225481 0.1440655 unknown
polarizability: 178.8518362|1.0978391|150.6036214|12.5468544|7.2921526|76.0967307 unknown
InChI: InChI=1S/C10H8N2O4/c1-5(13)12-7(10(15)16)8(14)6-3-2-4-11-9(6)12/h2-4,7,15H,1H3
charge 0 multiplicity 1
24 atoms
O  -0.257391 -2.829783 -0.772496
O  -3.200094 -1.55983 -0.000502
O  -0.309362 3.121728 -0.378584
O  -2.106908 -0.442609 1.731095
N  -0.403052 0.774338 -0.334183
N  1.91342 1.38909 0.236385
C  -1.147835 -0.484093 -0.561288
C  0.962107 0.47755 -0.084615
C  1.204311 -0.925963 -0.206653
C  -0.040981 -1.616387 -0.545998
C  -0.994708 2.074859 -0.433579
C  -2.172575 -0.786332 0.535233
C  2.506196 -1.428148 -0.004799
C  3.513711 -0.496136 0.32125
C  -2.512103 2.097051 -0.595114
C  3.166126 0.878279 0.432063
H  -1.653969 -0.50758 -1.540581
H  2.706435 -2.500165 -0.096812
H  4.546354 -0.809681 0.495981
H  -3.000067 1.814382 0.355492
H  -2.881077 1.41972 -1.385373
H  -2.802883 3.127999 -0.843248
H  3.928898 1.619423 0.697164
H  -3.819749 -1.854114 0.720862
