program: Gaussian 09
title: 000280624
version: EM64L-G09RevD.01
frameworkgroup: C1[X(C9H15O6P)]
method: RPBEPBE
basis: SDD
operation: Freq
keyword: #p
keyword: freq=noraman
keyword: PBEPBE/SDD
title: #p freq=noraman PBEPBE/SDD
converged: YES YES NO NO
title: Mulliken charges:
elementType: P O O O O O O C C C C C C C C C H H H H H H H H H H H H H H H
charge: 0.561005 -0.235513 -0.224287 -0.224605 -0.185086 -0.191041 -0.195394 -0.273270 -0.268474 -0.269208 -0.002102 -0.016203 -0.014030 -0.656655 -0.658749 -0.655879 0.226893 0.234948 0.241556 0.227492 0.239111 0.228472 0.217872 0.254516 0.232083 0.219748 0.236291 0.249646 0.220003 0.229610 0.251250
chargesum: 0.00000
title: Mulliken charges with hydrogens summed into heavy atoms:
elementType: P O O O O O O C C C C C C C C C
charge: 0.561005 -0.235513 -0.224287 -0.224605 -0.185086 -0.191041 -0.195394 0.188571 0.200575 0.198375 -0.002102 -0.016203 -0.014030 0.047815 0.046937 0.044983
polarizability: 1.79830353e+02 3.92579080e-01 1.56215199e+02 1.19568795e+00 -1.80562218e+00 1.12657666e+02
1716.lowfreq: -20.4676 0.0021 0.0024 0.0027 3.6460 5.4874 7.4574 14.3592 35.4592
frequency: -17.8458 13.3181 35.4539 38.2186 47.7837 56.1622 78.4470 87.1152 92.9772 108.4650 117.7925 124.6723 183.9250 191.9409 195.0034 227.1504 252.8878 264.0620 302.1914 307.9918 324.1330 368.3813 384.9356 415.6958 428.7254 450.4416 462.1793 607.2474 614.8372 632.7700 728.3848 729.1235 731.9342 796.2293 798.8229 803.4381 814.3206 814.9233 815.2797 997.1365 998.0177 999.8379 1028.7262 1044.1244 1093.8735 1095.9112 1096.3331 1099.0718 1153.3313 1153.5164 1155.0370 1270.3036 1270.7002 1271.5628 1346.0879 1346.6981 1347.4955 1391.5865 1392.4927 1394.2121 1456.5184 1457.7621 1458.7839 1462.6912 1463.2437 1463.3605 1483.8604 1484.4253 1485.3751 1609.6394 1620.5756 1639.8907 2994.4944 2994.6463 2994.9811 3031.9613 3035.8803 3037.0824 3089.7439 3089.9512 3090.0557 3097.5243 3097.6342 3099.1744 3123.6737 3124.9207 3126.6055
redmass: 3.8825 4.5552 3.6668 3.6537 3.4091 3.0616 4.9416 4.0754 5.3053 4.8757 4.2889 4.6950 2.2811 1.6233 1.5119 1.6060 2.0705 2.3163 2.9111 4.1634 5.3964 10.9133 5.8070 3.7757 3.5007 6.2774 9.0978 11.3910 10.8618 11.5190 3.3382 3.2613 3.2008 3.9472 3.9211 3.6550 1.3737 1.3495 1.3460 2.3958 2.4049 2.4315 8.9693 8.7935 2.7531 2.2487 2.1786 4.7625 1.6408 1.6353 1.6472 1.1238 1.1232 1.1233 1.2534 1.2522 1.2548 1.2266 1.2263 1.2263 1.0968 1.0942 1.0896 1.0496 1.0437 1.0431 1.0527 1.0520 1.0519 10.1462 10.3299 10.7184 1.0362 1.0362 1.0364 1.0597 1.0597 1.0598 1.0973 1.0972 1.0972 1.1032 1.1027 1.1026 1.1063 1.1069 1.1071
irintensity: 1.2756 1.3314 1.5211 0.7868 0.7087 0.7216 0.4168 1.0069 0.4318 1.0328 0.9236 0.1133 2.5495 8.1877 3.9158 1.1271 1.5799 5.4483 4.8085 23.3512 7.5328 6.2452 1.9181 4.0682 4.4694 1.8058 2.1464 9.5688 19.7918 0.2401 2.6306 13.7725 32.4464 1.9896 2.3943 5.0762 11.3664 3.7879 2.4264 7.1476 35.8073 20.4222 413.7619 932.8305 85.8657 15.8632 7.9400 85.4574 15.8592 14.0916 17.0365 3.0812 4.0683 3.3101 3.3919 2.0426 2.2973 27.2194 25.0417 25.4091 10.6589 19.2746 18.9598 10.8004 14.1146 15.5126 14.1729 12.9616 13.4943 100.1715 249.4991 197.7749 22.8864 16.0814 17.2508 25.0158 19.0410 27.2395 25.6015 30.7098 36.8192 0.6126 1.6942 2.2681 28.2657 24.3702 23.5134
temp: 298.150 k
press: 1.00000 atm
elementType: 15 8 8 8 8 8 8 6 6 6 6 6 6 6 6 6 1 1 1 1 1 1 1 1 1 1 1 1 1 1 1
symmnumber: 1
zpe: 619114.6 jmol-1
zpe.correction: 0.235808 hartree
zpe.thermalcorrener: 0.255208 hartree
zpe.thermalcorrenthalpy: 0.256152 hartree
zpe.thermalcorrgfe: 0.184771 hartree
zpe.sumelectzpe: -1143.251297 hartree
zpe.sumelectthermal: -1143.231898 hartree
zpe.sumelectthermalent: -1143.230953 hartree
zpe.sumelectthermalfe: -1143.302334 hartree
dipole: 1.7668 2.5276 2.4839
dipole: 3.9598
quadrupole: -75.7405 -102.3208 -104.4719
quadrupole: 0.3564 -3.1520 7.0146
quadrupole: 18.4372 -8.1431 -10.2941 0.3564 -3.1520 7.0146
hfenergy: -1143.4871053 hartree
pointgroup: C01 [X(C9H15O6P1)]
dipole: 0.501147 -0.5318369 -1.375883 debye
polarizability: 178.2829727|1.9308686|150.6924931|-9.7088923|14.4882712|119.7277531 unknown
InChI: InChI=1S/C9H15O6P/c1-4-13-7(10)16(8(11)14-5-2)9(12)15-6-3/h4-6H2,1-3H3
charge 0 multiplicity 1
31 atoms
P  0.088673 -0.52426 1.03967
O  2.553962 0.063576 0.166656
O  -2.385904 -0.185609 -0.14326
O  0.554609 -1.788122 -1.379377
O  1.00151 1.626465 -0.621572
O  -1.68571 1.622517 1.164331
O  -0.834655 -2.984071 0.071113
C  3.665863 0.76224 -0.568103
C  -3.712365 0.484566 -0.400172
C  0.495819 -2.907739 -2.386928
C  1.282802 0.596957 0.017323
C  -1.496819 0.496798 0.666855
C  -0.150816 -1.97971 -0.202277
C  4.205027 1.931774 0.258252
C  -4.689366 0.199355 0.741694
C  1.54802 -3.972212 -2.070538
H  4.41409 -0.03412 -0.704943
H  3.277158 1.096638 -1.545919
H  -3.53097 1.565535 -0.529797
H  -4.03484 0.032509 -1.350785
H  -0.526256 -3.324299 -2.378701
H  0.692399 -2.392302 -3.339842
H  5.078817 2.375535 -0.254316
H  3.439927 2.716789 0.376758
H  4.527405 1.591569 1.257129
H  -5.683132 0.613172 0.488255
H  -4.798163 -0.886525 0.90352
H  -4.350952 0.670067 1.679744
H  1.556525 -4.733137 -2.872956
H  2.55464 -3.524409 -2.008746
H  1.3235 -4.480145 -1.117869
