program: Gaussian 09
title: 000280636
version: EM64L-G09RevD.01
frameworkgroup: C1[X(C18H16ClN5)]
method: RPBEPBE
basis: SDD
operation: Freq
keyword: #p
keyword: freq=noraman
keyword: PBEPBE/SDD
title: #p freq=noraman PBEPBE/SDD
converged: YES YES NO NO
title: Mulliken charges:
elementType: Cl N N N N N C C C C C C C C C C C C C C C C C C H H H H H H H H H H H H H H H H
charge: -0.039938 -0.082266 -0.055974 -0.065796 -0.102663 -0.577746 0.077670 -0.071132 0.397261 0.128888 0.350181 0.178365 -0.382732 -0.377731 -0.764778 -0.076975 -0.406031 -0.208308 -0.236354 -0.236809 -0.797076 -0.239094 -0.224182 -0.239755 0.253370 0.259088 0.262620 0.239474 0.238362 0.240099 0.225034 0.229974 0.236882 0.265453 0.213395 0.227809 0.233954 0.256485 0.336130 0.334847
chargesum: 0.00000
title: Mulliken charges with hydrogens summed into heavy atoms:
elementType: Cl N N N N N C C C C C C C C C C C C C C C C C C
charge: -0.039938 -0.082266 -0.055974 -0.065796 -0.102663 0.093231 0.077670 -0.071132 0.397261 0.128888 0.350181 0.178365 -0.129362 -0.118644 -0.024324 -0.076975 -0.165932 -0.208308 -0.011320 -0.006834 -0.081345 -0.011285 0.009772 0.016731
polarizability: 4.19743850e+02 -1.97023621e+01 2.49573226e+02 1.12244622e+01 1.33560468e+01 1.84748316e+02
1716.lowfreq: -7.4590 -1.9352 0.0015 0.0015 0.0023 2.8486 20.2601 30.0456 34.6041
frequency: 20.2259 30.0379 34.5428 51.5933 65.4202 71.3235 97.2824 106.5042 120.9611 128.0893 160.3495 180.1398 203.8569 205.5797 226.0951 231.5811 255.1458 265.7765 310.1491 314.1222 332.0845 373.7295 393.8135 404.3542 411.4530 474.1470 477.1798 505.4001 511.3712 527.3492 532.0466 542.2119 550.1398 566.2326 594.0864 605.8789 617.7235 645.6294 663.6716 697.0177 706.5422 731.9583 767.6608 774.8769 784.0455 801.2833 824.7153 843.3419 853.3841 880.4677 895.2663 927.1256 966.3148 969.2787 979.5972 988.5656 989.6317 994.2563 997.4763 1028.2931 1041.7156 1045.7970 1063.3930 1076.1428 1085.3009 1112.3347 1133.7808 1171.9816 1172.3348 1187.2119 1191.4993 1231.4441 1255.9656 1279.8103 1316.2195 1334.3087 1353.4378 1367.2464 1372.5113 1381.7793 1392.2692 1397.9886 1401.7143 1431.7116 1439.1897 1440.9418 1450.6858 1452.0921 1470.6323 1475.8363 1477.3634 1492.4731 1535.6755 1558.3155 1585.7735 1591.8478 1606.6376 1611.6716 2986.1494 2994.2307 3067.3252 3079.7938 3096.3144 3124.8182 3126.8159 3134.2696 3134.4013 3146.4160 3153.4313 3157.9381 3168.3295 3173.2431 3553.3391 3713.1410
redmass: 6.2944 5.4016 4.8593 4.3754 5.0547 4.5498 3.9699 1.1267 3.5609 1.1625 5.4778 7.0744 4.4774 3.5170 4.6162 6.6127 8.3303 3.6433 5.6010 3.9848 4.2483 5.0496 5.1455 2.9906 6.0463 3.9259 5.7772 1.2266 4.0038 4.1425 4.8438 4.8831 1.0687 6.2342 4.9851 3.8322 6.0233 7.0761 6.6002 2.4788 3.0803 4.9289 2.2966 1.2675 7.0804 5.9890 5.9027 5.5100 1.2570 5.8004 1.3342 1.4577 2.5785 1.4616 1.4012 2.9967 3.5055 1.6449 1.4410 2.0982 1.6249 1.5673 2.1573 2.0309 1.6215 3.5057 2.8297 1.6441 1.0824 1.8565 1.1178 4.6664 2.1645 6.7410 1.5479 3.9142 7.8888 5.6982 5.5377 6.4379 1.3235 1.2436 2.6381 1.9047 1.9152 1.5587 1.4207 1.2481 3.2134 1.7945 1.1606 2.9877 4.2620 6.3697 6.0504 6.1119 1.9146 3.5766 1.0368 1.0395 1.0958 1.0920 1.1007 1.0847 1.1020 1.0883 1.0872 1.0935 1.0925 1.0963 1.1004 1.0987 1.0441 1.1059
irintensity: 0.3147 0.1205 0.3660 0.5474 0.6717 0.3703 0.8541 0.8989 0.7892 0.6375 0.5283 14.3488 8.7621 0.7082 6.5312 1.9614 0.6926 4.5706 16.9440 2.1684 2.1876 8.5708 2.9904 1.1426 8.7384 2.7894 17.9406 273.1324 6.6902 5.0827 1.9423 2.9229 0.2502 5.4775 3.5290 11.1942 2.9276 4.6090 8.9075 41.0930 6.4517 14.6190 53.1883 52.1156 17.2984 12.4852 11.3338 21.0989 1.7446 10.0985 0.0960 3.8895 7.1390 0.5238 1.4535 6.5141 0.1681 4.5097 0.9063 7.4604 7.8867 13.4556 10.1041 4.7585 9.3512 9.0044 3.5673 3.0241 0.5703 7.2772 2.3206 16.5499 6.0926 5.4799 2.4625 32.9038 28.6091 22.2275 69.6574 0.9470 30.4398 19.5543 8.0625 11.7053 15.7042 40.9690 17.8516 42.1060 175.0573 138.0461 12.9267 35.3641 548.6101 21.8898 2.1490 9.4559 493.5589 178.2099 23.0401 8.3042 12.3861 11.6246 20.3763 0.5017 9.6449 7.1744 6.5707 20.9453 15.6607 20.1282 19.1570 20.8419 253.0287 49.0788
temp: 298.150 k
press: 1.00000 atm
elementType: 17 7 7 7 7 7 6 6 6 6 6 6 6 6 6 6 6 6 6 6 6 6 6 6 1 1 1 1 1 1 1 1 1 1 1 1 1 1 1 1
symmnumber: 1
zpe: 795548.8 jmol-1
zpe.correction: 0.303009 hartree
zpe.thermalcorrener: 0.324912 hartree
zpe.thermalcorrenthalpy: 0.325856 hartree
zpe.thermalcorrgfe: 0.250433 hartree
zpe.sumelectzpe: -1427.629567 hartree
zpe.sumelectthermal: -1427.607664 hartree
zpe.sumelectthermalent: -1427.606720 hartree
zpe.sumelectthermalfe: -1427.682142 hartree
dipole: 0.3260 0.8343 1.8628
dipole: 2.0669
quadrupole: -112.8889 -141.5553 -142.1213
quadrupole: -3.3357 3.5512 0.1892
quadrupole: 19.2996 -9.3668 -9.9328 -3.3357 3.5512 0.1892
hfenergy: -1427.9325757 hartree
pointgroup: C01 [X(C18H16Cl1N5)]
dipole: 0.1141419 0.40374 0.6966013 debye
polarizability: 407.684499|-38.5490134|259.1557784|36.0009698|-1.2128533|187.2251149 unknown
InChI: InChI=1S/C18H16ClN5/c1-11-7-6-10-14(19)15(11)23-24-16-12(2)21-18(20)22-17(16)13-8-4-3-5-9-13/h3-10H,20H2,1-2H3
charge 0 multiplicity 1
40 atoms
Cl -2.1415 -1.311182 -2.435964
N  3.310699 -0.130188 0.298071
N  -0.293958 -1.155891 -0.078141
N  3.048851 -2.555991 0.52228
N  -0.916938 -0.087171 0.35477
N  5.079149 -1.491084 1.001287
C  1.989505 0.004486 -0.016913
C  1.113146 -1.140783 0.05502
C  1.596794 1.346295 -0.535954
C  1.722402 -2.430608 0.256057
C  -3.072587 0.689445 1.105741
C  -2.320215 -0.030666 0.112826
C  2.170851 2.50828 0.040427
C  0.742275 1.483999 -1.66284
C  0.904897 -3.697533 0.228575
C  3.769484 -1.384623 0.606583
C  -4.460747 0.87241 0.925786
C  -3.009758 -0.500443 -1.044632
C  1.869241 3.787442 -0.474242
C  0.457169 2.760691 -2.186947
C  -2.371392 1.218587 2.340605
C  1.009992 3.9192 -1.589329
C  -5.121104 0.383642 -0.224011
C  -4.389948 -0.294839 -1.223065
H  2.853033 2.393288 0.888535
H  0.314732 0.595668 -2.140007
H  0.130946 -3.649788 -0.554478
H  1.572474 -4.559691 0.075493
H  0.374244 -3.835311 1.189692
H  -5.028141 1.410724 1.692794
H  2.308839 4.678012 -0.011246
H  -0.194569 2.85267 -3.06277
H  -2.062232 0.395016 3.0108
H  -1.447372 1.75491 2.063381
H  -3.03421 1.893717 2.908167
H  0.778921 4.910958 -1.994185
H  -6.196954 0.540222 -0.354244
H  -4.880273 -0.657607 -2.130962
H  5.455984 -2.410728 1.216262
H  5.660566 -0.657234 1.022877
