program: Gaussian 09
title: 000280615
version: EM64L-G09RevD.01
frameworkgroup: C1[X(C11H8BrNO3)]
method: RPBEPBE
basis: SDD
operation: Freq
keyword: #p
keyword: freq=noraman
keyword: PBEPBE/SDD
title: #p freq=noraman PBEPBE/SDD
converged: YES YES NO NO
title: Mulliken charges:
elementType: Br O O O N C C C C C C C C C C C H H H H H H H H
charge: 0.116937 -0.242840 -0.206319 -0.131150 0.046503 0.445211 -0.286803 -0.058264 0.445551 -0.266059 0.187466 0.173767 -0.667360 -0.299452 -0.777614 -0.489818 0.290753 0.248206 0.234496 0.234453 0.268627 0.248142 0.237434 0.248130
chargesum: 0.00000
title: Mulliken charges with hydrogens summed into heavy atoms:
elementType: Br O O O N C C C C C C C C C C C
charge: 0.116937 -0.242840 -0.206319 -0.131150 0.046503 0.445211 -0.286803 -0.058264 0.445551 0.024694 0.187466 0.173767 -0.667360 -0.051246 -0.040037 0.243888
polarizability: 2.37042949e+02 1.69495752e+00 1.99325542e+02 -1.43814277e-02 2.32972169e-02 6.46274382e+01
1716.lowfreq: -23.6855 -1.1135 -0.9024 -0.0004 -0.0003 -0.0002 6.8250 30.0526 47.3413
frequency: -23.5958 30.0335 47.3265 73.4718 93.8172 141.2546 145.9380 174.2838 209.6433 227.0550 227.9632 272.8494 285.3729 337.8221 367.6830 382.1737 397.2847 429.7621 457.7460 470.4479 543.0954 572.4768 618.2996 673.2354 721.4213 736.7618 746.7857 814.4829 853.8528 853.9095 893.1441 917.7910 987.4531 1008.1069 1020.8334 1048.7933 1074.2305 1101.0574 1138.5457 1145.2834 1210.3559 1229.9231 1268.0729 1302.2278 1330.1410 1356.9735 1394.9748 1435.4626 1440.7048 1450.3254 1454.4098 1461.5751 1468.7403 1525.9146 1536.1913 1553.0801 1566.6960 1585.0121 2986.3860 3014.7248 3063.2611 3126.2295 3131.3076 3142.0101 3147.5552 3168.3267
redmass: 1.0276 3.8696 8.6778 4.8399 5.2285 9.2312 6.9077 4.3169 1.2323 9.7133 3.7291 4.8534 6.1937 9.5817 6.6847 4.6173 5.0111 4.2801 11.4106 6.9372 6.7495 5.0191 7.9986 6.8787 4.9308 8.5733 7.4079 9.2255 1.9319 6.9232 3.3649 4.8394 2.0221 1.3673 4.4210 1.6172 3.0599 1.2356 1.4694 1.7546 3.5930 3.4747 3.0065 6.6242 8.7559 4.6699 1.2498 1.3926 1.9135 1.0701 1.0534 1.3519 1.0461 6.3142 9.6966 10.5606 8.3429 7.4534 1.0389 1.0276 1.0968 1.0982 1.1055 1.1068 1.0890 1.0977
irintensity: 0.6235 7.7519 0.5109 5.1240 0.0581 0.6113 0.1086 2.7842 0.5917 1.0630 6.3779 0.3684 0.0262 2.8922 4.6017 15.0795 7.1837 0.5830 1.3675 0.0594 1.5624 15.6986 24.4748 0.5534 6.4238 28.2515 5.3352 59.4880 13.0339 19.3637 13.7485 6.9387 44.3685 1.5878 47.0684 9.8021 59.9514 0.0037 50.0804 31.8592 15.5489 250.9083 58.1077 219.0118 20.9479 27.0321 29.8427 26.0137 42.2106 35.9792 14.1836 12.1854 17.9789 34.5398 460.6999 146.4401 117.1991 29.8013 9.3835 36.8629 13.7939 4.7572 21.0440 23.4098 4.9377 7.4610
temp: 298.150 k
press: 1.00000 atm
elementType: 35 8 8 8 7 6 6 6 6 6 6 6 6 6 6 6 1 1 1 1 1 1 1 1
symmnumber: 1
zpe: 434197.0 jmol-1
zpe.correction: 0.165377 hartree
zpe.thermalcorrener: 0.179613 hartree
zpe.thermalcorrenthalpy: 0.180557 hartree
zpe.thermalcorrgfe: 0.122343 hartree
zpe.sumelectzpe: -716.684665 hartree
zpe.sumelectthermal: -716.670429 hartree
zpe.sumelectthermalent: -716.669485 hartree
zpe.sumelectthermalfe: -716.727699 hartree
dipole: -2.6446 5.0078 0.0083
dipole: 5.6632
quadrupole: -76.6470 -107.7611 -100.3418
quadrupole: 3.2622 -0.0086 -0.0071
quadrupole: 18.2696 -12.8445 -5.4251 3.2622 -0.0086 -0.0071
hfenergy: -716.8500414 hartree
pointgroup: C01 [X(C11H8Br1N1O3)]
dipole: -0.455832 -2.1612117 0.2926316 debye
dipolederiv: -0.3496232 -0.4439082 0.0458756 -0.41974 -0.3942713 0.0441574 0.0425094 0.0431073 0.0420241 -1.3952562 0.9454204 -0.1958331 0.3884655 -0.4321762 0.0431185 -0.1136361 0.0712742 -0.2882131 -0.7465271 0.0617832 -0.0323765 0.2066089 -1.0762199 0.1271978 -0.0535849 0.119547 -0.307934 -0.5323533 0.1282544 -0.0319629 0.2308768 -0.8150325 0.0912186 -0.0470649 0.0864458 -0.2856976 -0.8145152 0.0264169 -0.0344177 -0.2174174 -0.1940415 -0.0143426 0.0011532 -0.001973 -0.2156025 -0.927814 0.0942553 -0.063661 -0.0155412 -0.1592131 0.0307784 -0.047438 0.0364908 0.0476739 0.2065098 -0.2557662 0.0447041 -0.057067 0.0324706 0.0025086 0.015503 -0.0076209 0.0712457 1.5414347 0.4286344 0.0072884 -0.0414049 1.3368064 -0.1777839 0.0764855 -0.1535507 0.1758715 0.8790649 -1.2962267 0.2253758 -1.0111908 -0.5178846 0.0559847 0.1831442 0.0415493 0.2081421 0.3090536 -0.0865605 0.0321735 0.1336191 0.1409847 -0.0251467 -0.0002954 -0.0365501 -0.0706551 1.1609863 -0.3729518 0.1032197 -0.3776542 0.7417119 -0.0976161 0.1041964 -0.0976952 0.2202187 0.9959491 -0.1297221 0.0672295 -0.2981448 0.1586974 -0.0305984 0.0926349 -0.0220436 0.0615634 -0.3469389 1.0063407 -0.1546612 1.284133 0.5084048 -0.046219 -0.1957485 -0.0606241 -0.2374987 -0.3650371 0.1727824 -0.0371159 0.4737699 -0.0668651 0.0145436 -0.0816336 -0.000648 -0.1361294 -0.4504626 0.0679332 -0.0351018 -0.0247649 0.0292628 0.0003383 -0.021833 0.0052147 0.0369397 0.6325819 -0.3127194 0.063883 -0.362212 0.5422781 -0.0569775 0.0710961 -0.0542887 0.2910952 0.1192436 0.0822546 -0.0134169 0.0046528 0.0289266 0.0172714 -0.0018852 0.0213559 0.1418599 -0.0200306 -0.0966942 0.0054276 -0.103426 0.0250953 0.0134594 0.0063843 0.0137773 0.1507806 0.0260466 -0.0092039 -0.0569493 -0.0008967 0.0468644 -0.0997335 -0.1057075 -0.0704347 -0.0128991 0.0090849 0.0023787 0.0627289 0.0211675 0.0890709 0.07279 0.1073087 0.0418886 -0.0378998 0.1125023 -0.0395568 0.0052523 0.0647989 -0.0517225 0.0288308 -0.00996 0.0235095 0.1194843 0.0537457 0.0008756 0.076611 0.0992075 -0.0030248 0.0587479 0.0331384 0.0552551 -0.0586853 -0.1625112 0.0399824 -0.0199159 -0.0704844 0.0677892 0.0043055 -0.0035622 0.0097593 0.1188918 0.0648659 -0.0140022 -0.0643569 0.0926444 -0.0379116 -0.0568331 -0.0512049 -0.0637456 -0.0345765 unknown
polarizability: 234.6479062|9.699527|198.5240789|7.1461626|-19.2438358|67.8239446 unknown
InChI: InChI=1S/C11H8BrNO3/c1-5-3-4-6-8(13-5)10(15)7(12)11(16-2)9(6)14/h3-4H,1-2H3
charge 0 multiplicity 1
24 atoms
Br 2.845297 2.770468 -0.092766
O  3.289828 -0.169649 0.364998
O  1.268215 -2.25258 0.571227
O  -0.232714 2.982001 -0.274847
N  -2.233603 1.037178 -0.091089
C  -0.510596 -0.668115 0.246912
C  -0.926495 0.671875 0.028921
C  0.921468 -1.043419 0.375021
C  1.939781 0.055164 0.263915
C  -1.509331 -1.67077 0.343618
C  0.106169 1.781325 -0.08175
C  -3.195199 0.0667 0.002441
C  1.52621 1.36618 0.050094
C  -2.858199 -1.301916 0.220708
C  -4.631915 0.513276 -0.137048
C  3.911729 -1.499331 0.591677
H  -1.202758 -2.707753 0.511991
H  -3.653838 -2.050412 0.290046
H  -5.125021 0.009336 -0.989353
H  -5.216192 0.266129 0.769071
H  -4.666792 1.600903 -0.297735
H  3.581075 -1.93064 1.548901
H  4.986844 -1.266808 0.610232
H  3.668034 -2.192642 -0.227784
