program: Gaussian 09
title: 000025239
version: EM64L-G09RevD.01
frameworkgroup: C1[X(C11H14O2)]
method: RPBEPBE
basis: SDD
operation: Freq
keyword: #pfreq=noraman
keyword: PBEPBE/SDD
title: #p freq=noraman PBEPBE/SDD
converged: YES YES NO NO
title: Mulliken charges:
elementType: O O C C C C C C C C C C C H H H H H H H H H H H H H H
charge: -0.259890 -0.254290 -0.266837 0.556650 -0.270702 -0.712714 -0.445972 -0.402299 -0.224283 -0.242373 -0.245408 0.296686 -0.754624 0.226640 0.221209 0.235056 0.214324 0.214683 0.237348 0.232111 0.226216 0.224767 0.224273 0.228091 0.252482 0.245102 0.243753
chargesum: 0.00000
title: Mulliken charges with hydrogens summed into heavy atoms:
elementType: O O C C C C C C C C C C C
charge: -0.259890 -0.254290 -0.040197 0.556650 0.185563 -0.046359 -0.213861 -0.176083 0.000484 -0.018100 -0.017317 0.296686 -0.013287
polarizability: 1.19721631e+02 -1.75990414e+01 1.20113328e+02 1.62090030e-01 4.14148534e+00 1.16384859e+02
1716.lowfreq: -15.1996 -13.0900 -9.4629 -6.4547 -3.9906 0.0004 0.0008 0.0010 23.9280
frequency: -12.8479 -9.9916 23.8114 44.0795 116.4210 118.8011 186.7652 202.7890 217.1882 242.6289 266.1280 357.6807 403.2967 418.7216 475.3811 544.9734 551.9228 565.2099 611.2853 618.5656 705.0708 739.3215 771.0669 831.4300 850.7158 894.8691 916.6819 936.7228 962.0535 973.6822 989.9008 993.0374 1005.3853 1017.9259 1037.2927 1042.7351 1061.2078 1097.0840 1138.6102 1171.8248 1188.9392 1198.6072 1209.0311 1218.7435 1283.6892 1308.0960 1350.0911 1354.0786 1381.5474 1386.8465 1393.6644 1443.3081 1453.4781 1455.1115 1469.5951 1473.4244 1478.3013 1487.6738 1594.3626 1614.2214 1650.0087 2980.6028 3000.6825 3002.9174 3007.6277 3068.2139 3076.0910 3089.7382 3096.0780 3112.4920 3117.4912 3131.3286 3142.7109 3143.1268 3161.3078
redmass: 1.3367 3.2620 3.8944 3.5856 3.2928 3.6679 2.9220 1.3840 2.2802 3.1572 2.8686 3.6157 2.7980 3.7312 3.4386 2.8714 2.9822 3.0729 5.1242 5.6980 1.6641 3.7882 1.9034 5.7051 1.2505 1.7507 1.4254 1.6534 2.8962 1.3965 5.6802 1.3198 2.3274 2.5118 1.7414 1.6626 2.2611 1.8198 2.1410 1.0540 1.1325 1.5800 1.7977 2.1146 1.3279 1.4800 1.4260 1.5217 1.2607 3.6970 1.2808 2.1072 1.0633 1.0474 1.0734 1.0873 1.2646 1.6282 5.9648 6.1352 9.1509 1.0359 1.0723 1.0695 1.0367 1.1034 1.1025 1.0995 1.0974 1.0867 1.0866 1.0908 1.0959 1.1009 1.1015
irintensity: 0.5601 1.7516 0.1664 0.8159 0.3853 4.5885 2.5815 2.1349 1.4087 5.2167 0.7715 2.4024 0.0104 2.6724 4.2840 23.1389 2.3826 3.3000 2.2034 1.0938 57.1452 1.6282 41.6546 16.7988 0.0332 3.4748 1.6884 1.7495 33.5775 0.0903 0.1323 0.1165 116.4785 20.4719 3.8730 11.1670 5.6242 9.0905 0.8791 0.1074 8.5775 138.2752 193.3719 17.1981 1.7224 4.2664 2.4121 0.4463 60.8923 0.5322 6.9724 9.5734 25.8978 17.0324 0.8683 17.2605 5.7617 22.4134 1.1759 6.2938 195.9193 27.4832 17.1146 24.6579 4.0463 1.0869 74.5795 25.3447 8.2704 10.1787 4.7910 11.8820 41.6716 13.7917 21.9204
temp: 298.150 k
press: 1.00000 atm
elementType: 8 8 6 6 6 6 6 6 6 6 6 6 6 1 1 1 1 1 1 1 1 1 1 1 1 1 1
symmnumber: 1
zpe: 583930.1 jmol-1
zpe.correction: 0.222407 hartree
zpe.thermalcorrener: 0.234223 hartree
zpe.thermalcorrenthalpy: 0.235168 hartree
zpe.thermalcorrgfe: 0.183089 hartree
zpe.sumelectzpe: -577.049080 hartree
zpe.sumelectthermal: -577.037263 hartree
zpe.sumelectthermalent: -577.036319 hartree
zpe.sumelectthermalfe: -577.088398 hartree
dipole: 1.2093 0.1658 -1.7077
dipole: 2.0991
quadrupole: -82.2554 -70.3000 -76.1284
quadrupole: -1.0235 8.2144 1.2616
quadrupole: -6.0275 5.9279 0.0995 -1.0235 8.2144 1.2616
hfenergy: -577.2714868 hartree
pointgroup: C01 [X(C11H14O2)]
dipole: -0.5198886 0.2126417 0.6054273 debye
polarizability: 121.3349924|17.5029877|117.2757861|-3.2345917|-3.034294|117.6090394 unknown
InChI: InChI=1S/C11H14O2/c1-9(8-13-10(2)12)11-6-4-3-5-7-11/h3-7,9H,8H2,1-2H3
charge 0 multiplicity 1
27 atoms
O  1.832577 0.095714 0.675465
O  3.384829 -0.570818 -0.933521
C  -0.021913 1.627353 0.256751
C  -1.060206 0.521344 0.050553
C  1.380225 1.200691 -0.21426
C  -0.423359 2.943848 -0.461591
C  -1.733485 -0.048777 1.158876
C  -1.379247 0.047242 -1.249114
C  -2.703878 -1.061636 0.979791
C  -2.345438 -0.965718 -1.433999
C  -3.014086 -1.524021 -0.319118
C  2.846795 -0.734305 0.185029
C  3.168647 -1.817588 1.191873
H  0.048062 1.83539 1.342187
H  2.104295 2.031877 -0.121578
H  1.38688 0.846572 -1.260823
H  0.30066 3.751379 -0.244983
H  -0.465691 2.810737 -1.558417
H  -1.421361 3.275823 -0.127121
H  -1.490885 0.299889 2.170305
H  -0.871719 0.468066 -2.126446
H  -3.213276 -1.489336 1.850945
H  -2.57721 -1.320147 -2.444938
H  -3.764705 -2.309474 -0.462163
H  2.260536 -2.400859 1.421976
H  3.517688 -1.366172 2.136855
H  3.947065 -2.479977 0.787168
