program: Gaussian 09
title: 000280591
version: EM64L-G09RevD.01
frameworkgroup: C1[X(C16H13ClN2O2)]
method: RPBEPBE
basis: SDD
operation: Freq
keyword: #p
keyword: freq=noraman
keyword: PBEPBE/SDD
title: #p freq=noraman PBEPBE/SDD
converged: YES YES NO NO
title: Mulliken charges:
elementType: Cl O O N N C C C C C C C C C C C C C C C C H H H H H H H H H H H H H
charge: -0.077008 -0.210148 -0.208320 -0.212997 -0.377906 -0.461949 0.188188 0.188884 0.111573 0.106010 0.507645 -0.351773 -0.351401 -0.208900 -0.208647 -0.442452 -0.372391 0.529002 -0.244712 -0.426137 -0.799647 0.259122 0.272025 0.313621 0.270721 0.270256 0.240859 0.240669 0.249397 0.269924 0.233220 0.241545 0.241065 0.220659
chargesum: 0.00000
title: Mulliken charges with hydrogens summed into heavy atoms:
elementType: Cl O O N N C C C C C C C C C C C C C C C C
charge: -0.077008 -0.210148 -0.208320 -0.212997 -0.064285 0.069198 0.188188 0.188884 0.111573 0.106010 0.507645 -0.081052 -0.081145 0.031959 0.032022 -0.193055 -0.102467 0.529002 -0.244712 -0.192916 -0.096377
polarizability: 2.52536429e+02 -3.66892307e+00 2.08058336e+02 8.38373684e+00 1.24767064e+01 1.48944331e+02
1716.lowfreq: -5.7156 -4.7924 -2.4485 -0.0029 -0.0028 -0.0017 14.7335 31.3331 40.5895
frequency: 14.7008 31.3133 40.5752 71.3091 108.9906 124.3608 134.5828 139.9586 155.1379 175.4108 205.9252 221.0356 238.9302 264.4117 294.1938 325.4345 336.8251 367.3282 408.5005 424.6225 437.5429 447.6747 454.5718 482.5135 523.1643 539.9987 572.2794 584.9394 614.5586 659.6783 675.6459 687.2280 695.4410 699.1162 720.7645 736.9336 787.5523 797.5482 821.2606 840.4105 848.5460 853.4614 907.5264 917.3385 948.9635 971.1460 975.3060 995.9984 1007.3843 1013.0761 1018.1510 1045.3409 1072.1728 1095.8653 1145.6110 1163.9199 1170.7764 1177.1051 1190.5879 1222.4706 1261.7718 1278.8838 1284.2851 1314.8511 1325.3207 1365.2430 1398.4885 1401.9954 1414.1332 1417.1399 1452.3363 1453.8654 1459.5167 1462.0272 1464.6638 1488.1591 1517.9429 1575.6917 1613.7157 1616.2064 1625.0931 1633.5676 1674.0563 2979.9278 3034.5249 3057.8724 3088.9300 3096.5218 3128.5297 3141.1740 3146.0515 3153.6860 3154.3897 3165.8415 3175.7949 3563.4575
redmass: 7.1534 6.6730 6.2978 6.4331 4.5266 1.2396 3.8599 4.7887 5.3493 7.0777 5.6006 5.8043 6.3676 4.0678 3.2061 7.3900 3.6681 6.1907 3.2315 4.5762 3.0239 4.3674 4.4972 1.3887 7.1433 4.0819 3.9160 4.8162 6.5575 4.7906 6.4675 6.7146 4.3262 3.1309 3.4588 3.5795 5.1773 1.7493 1.3071 5.4202 1.7969 4.5609 1.3990 7.5217 1.3350 2.6423 1.4168 1.5188 1.3506 2.0886 3.1405 1.4890 2.6589 3.5656 2.8710 1.4563 1.8681 1.5182 2.0875 1.7144 3.1901 1.8586 1.5324 2.1177 1.8580 2.4666 1.4135 1.2431 3.3566 5.0602 2.5389 2.4478 1.1563 1.0451 1.3085 1.5070 2.7663 4.1583 7.6570 8.2916 9.4793 7.6050 11.8358 1.0368 1.0589 1.0975 1.0994 1.1064 1.0885 1.0865 1.0921 1.0962 1.0906 1.0957 1.1004 1.0768
irintensity: 0.4051 0.0987 0.1613 3.0852 2.8082 0.8176 0.9619 0.2725 1.6441 1.7060 0.8483 0.6536 0.1256 5.5913 3.0270 16.3287 12.2210 5.9161 2.2356 4.6608 1.5184 28.1097 3.3056 89.1405 9.9005 50.7816 15.3048 7.6067 31.7866 0.3794 1.6952 4.4401 18.4110 13.2933 79.0308 19.9626 0.9677 22.8467 32.3734 7.2722 43.7576 22.8203 0.0304 9.8246 4.0467 54.0174 2.2406 32.3279 0.0090 6.6847 67.4079 7.2729 12.4136 81.2354 111.9164 2.2360 1.0270 22.1485 20.1226 28.4946 324.6110 216.6006 22.1291 33.2487 53.0471 25.8789 32.0777 9.7708 0.8047 15.7022 3.0763 11.0090 33.9852 13.0963 3.2550 27.4611 217.6732 58.4415 5.3965 136.2060 184.7876 264.0793 78.8581 36.5378 27.1565 17.8303 17.4510 1.8974 12.5563 1.6001 4.4427 2.2583 4.7766 5.1433 20.4526 30.7049
temp: 298.150 k
press: 1.00000 atm
elementType: 17 8 8 7 7 6 6 6 6 6 6 6 6 6 6 6 6 6 6 6 6 1 1 1 1 1 1 1 1 1 1 1 1 1
symmnumber: 1
zpe: 669841.6 jmol-1
zpe.correction: 0.255129 hartree
zpe.thermalcorrener: 0.273426 hartree
zpe.thermalcorrenthalpy: 0.274370 hartree
zpe.thermalcorrgfe: 0.206747 hartree
zpe.sumelectzpe: -1336.085009 hartree
zpe.sumelectthermal: -1336.066712 hartree
zpe.sumelectthermalent: -1336.065767 hartree
zpe.sumelectthermalfe: -1336.133390 hartree
dipole: -4.6893 1.0520 -0.7104
dipole: 4.8581
quadrupole: -118.4628 -125.8951 -127.4228
quadrupole: -1.3552 11.8958 -6.2920
quadrupole: 5.4641 -1.9682 -3.4959 -1.3552 11.8958 -6.2920
hfenergy: -1336.3401378 hartree
pointgroup: C01 [X(C16H13Cl1N2O2)]
dipole: 1.819931 0.5729383 0.1130231 debye
polarizability: 252.4452516|6.5328471|207.0717968|1.5929701|-16.1521699|150.0220468 unknown
InChI: InChI=1S/C16H13ClN2O2/c1-10-6-7-11(8-14(10)17)18-9-19-15(20)12-4-2-3-5-13(12)16(19)21/h2-8,18H,9H2,1H3
charge 0 multiplicity 1
34 atoms
Cl -5.419662 -1.420549 1.811784
O  0.922373 1.381152 -2.077406
O  1.803155 -2.740451 0.018995
N  1.105015 -0.824784 -1.198127
N  -1.125142 -1.876371 -1.084297
C  -0.018716 -1.483427 -1.922624
C  2.631537 0.731488 -0.379791
C  2.898612 -0.507812 0.254495
C  1.477408 0.54716 -1.318812
C  1.925121 -1.521529 -0.263444
C  -2.13254 -1.007291 -0.621744
C  3.3882 1.87747 -0.094387
C  3.931016 -0.641214 1.194472
C  4.435384 1.752744 0.85599
C  4.702481 0.513093 1.490561
C  -3.133013 -1.525584 0.248307
C  -2.209111 0.360569 -1.004844
C  -4.286551 0.676897 0.325978
C  -4.163851 -0.684778 0.692739
C  -3.270641 1.162591 -0.537332
C  -5.411824 1.564294 0.81615
H  -0.336845 -0.771099 -2.702507
H  0.392068 -2.386646 -2.403881
H  -1.042558 -2.78473 -0.627199
H  3.172516 2.829457 -0.589306
H  4.12781 -1.602739 1.678758
H  5.047212 2.626231 1.105244
H  5.516569 0.448021 2.220235
H  -3.106393 -2.573692 0.564473
H  -1.447428 0.81132 -1.648677
H  -3.311397 2.213847 -0.846003
H  -6.399529 1.168392 0.515331
H  -5.421824 1.634516 1.919748
H  -5.309954 2.58365 0.406823
