program: Gaussian 09
title: 000280584
version: EM64L-G09RevD.01
frameworkgroup: C1[X(C16H12ClNO2)]
method: RPBEPBE
basis: SDD
operation: Freq
keyword: #p
keyword: freq=noraman
keyword: PBEPBE/SDD
title: #p freq=noraman PBEPBE/SDD
converged: YES YES NO NO
title: Mulliken charges:
elementType: Cl O O N C C C C C C C C C C C C C C C C H H H H H H H H H H H H
charge: -0.024321 -0.251369 -0.188114 -0.291442 0.232602 0.163070 0.191708 0.213414 -0.451356 -0.394351 -0.394635 0.373857 -0.279470 0.205994 -0.391002 -0.238825 -0.260107 0.163261 -0.792923 -0.717115 0.318246 0.243401 0.243990 0.247824 0.281266 0.234880 0.230660 0.245604 0.245344 0.270175 0.284717 0.285017
chargesum: 0.00000
title: Mulliken charges with hydrogens summed into heavy atoms:
elementType: Cl O O N C C C C C C C C C C C C C C C C
charge: -0.024321 -0.251369 -0.188114 -0.291442 0.232602 0.163070 0.191708 0.213414 -0.133110 -0.150950 -0.150646 0.373857 -0.031646 0.205994 -0.109736 -0.003945 -0.029447 0.163261 -0.031800 -0.147380
polarizability: 3.46212484e+02 8.09107685e-01 2.13411525e+02 3.59803842e-01 -1.09898127e-01 8.10805334e+01
1716.lowfreq: -6.0682 -2.2146 -0.0009 0.0009 0.0026 2.9483 24.8145 41.6955 56.0889
frequency: 24.7775 41.5900 56.0661 73.6479 75.1559 96.3831 142.7184 178.2926 185.1823 198.5166 231.8145 276.8635 312.4966 319.8891 334.3409 340.9495 376.0075 397.0788 427.0636 459.4966 505.5129 509.9427 545.6585 554.9527 588.4807 590.2812 629.0914 640.5470 651.7587 698.5159 725.6042 741.7921 747.1381 758.0321 792.3448 793.7520 852.4567 870.8508 904.2215 918.4816 948.1482 950.8224 965.9154 986.9602 993.2198 995.3147 996.6063 1016.7941 1038.1039 1038.3964 1115.1106 1129.4113 1151.2950 1162.9880 1176.2796 1206.8642 1221.0156 1246.3660 1286.5533 1298.3133 1310.7589 1331.4507 1382.4720 1396.3804 1401.2626 1416.4375 1436.1537 1444.7208 1455.4194 1467.3970 1473.3950 1495.5039 1574.8766 1587.1747 1604.6891 1608.4020 1617.6145 1629.8899 2995.6587 3034.7795 3086.9435 3107.7089 3133.7021 3137.1320 3143.8850 3147.8251 3167.8381 3168.5133 3210.2020 3215.2139
redmass: 8.0188 3.5315 6.0020 3.4755 9.0943 4.6639 4.2244 4.7397 7.1337 9.1032 6.3668 1.1446 7.5918 4.3375 3.5051 4.8936 8.5817 7.9070 3.0928 3.0810 6.7828 3.0604 4.9494 3.1969 3.3266 4.3259 8.0721 6.2957 3.5631 6.5843 6.2143 2.7681 6.6374 1.6527 6.6213 2.8362 1.3970 1.5830 1.7036 4.0823 1.3989 1.6527 7.2959 1.3271 4.0412 3.8616 1.3657 2.0587 1.6718 1.9648 1.9536 1.7068 1.0887 1.6418 1.2421 1.9618 2.6344 1.5595 1.9678 1.7508 3.1513 2.3712 1.2377 4.7572 6.2122 1.0999 4.3387 2.1787 2.6585 1.2737 1.0495 3.6579 8.2485 6.8359 7.6475 8.1400 8.4778 7.8195 1.0378 1.0569 1.0988 1.1064 1.0984 1.0862 1.0889 1.0917 1.0967 1.0985 1.0925 1.0923
irintensity: 0.4238 1.2945 2.5949 12.3897 0.8253 0.1240 1.4772 0.4410 0.9685 1.2448 2.1562 1.8493 4.9682 0.1946 7.4881 0.7900 0.2754 1.4679 7.5859 0.1632 8.0712 2.1643 4.7556 1.3505 1.2063 25.4153 17.4163 5.4831 2.5244 22.5576 37.3692 32.4418 33.3343 58.9032 0.3704 13.1167 41.7566 2.5525 10.1309 10.3909 1.8458 6.9361 4.4599 0.0376 3.7815 24.9254 0.4704 29.0616 5.6230 4.6814 27.0980 9.7222 1.6318 35.9527 6.3045 53.4872 278.2162 47.0102 45.9705 31.5725 145.2199 182.4884 50.6081 38.5428 24.7749 12.6997 103.8556 32.2082 21.2139 4.7666 21.3104 32.4964 134.4145 23.6581 53.0767 123.1596 70.3837 1.9594 2.2201 25.8428 7.5879 2.4823 7.9216 0.6257 3.2684 11.8380 0.5448 31.7380 8.1374 9.5640
temp: 298.150 k
press: 1.00000 atm
elementType: 17 8 8 7 6 6 6 6 6 6 6 6 6 6 6 6 6 6 6 6 1 1 1 1 1 1 1 1 1 1 1 1
symmnumber: 1
zpe: 626099.3 jmol-1
zpe.correction: 0.238469 hartree
zpe.thermalcorrener: 0.255385 hartree
zpe.thermalcorrenthalpy: 0.256329 hartree
zpe.thermalcorrgfe: 0.192151 hartree
zpe.sumelectzpe: -1280.806617 hartree
zpe.sumelectthermal: -1280.789700 hartree
zpe.sumelectthermalent: -1280.788756 hartree
zpe.sumelectthermalfe: -1280.852934 hartree
dipole: -8.8436 0.9217 0.0004
dipole: 8.8915
quadrupole: -132.6455 -115.3114 -125.1961
quadrupole: 2.9206 0.0424 0.0622
quadrupole: -8.2612 9.0729 -0.8118 2.9206 0.0424 0.0622
hfenergy: -1281.0450856 hartree
pointgroup: C01 [X(C16H12Cl1N1O2)]
dipole: -3.4916099 0.211372 0.0361993 debye
polarizability: 345.9041093|6.309798|210.1926484|1.3443054|21.3411263|84.6077848 unknown
InChI: InChI=1S/C16H12ClNO2/c1-10(19)18-14-5-3-2-4-12(14)13-7-6-11(8-15(13)18)16(20)9-17/h2-8H,9H2,1H3
charge 0 multiplicity 1
32 atoms
Cl 6.185197 0.818534 0.057415
O  0.257446 2.72287 0.393127
O  4.601472 -1.699556 -0.331227
N  -1.061665 0.831277 0.077732
C  0.053959 -0.070556 -0.070269
C  -0.449019 -1.390254 -0.28834
C  -1.902498 -1.314896 -0.278927
C  -2.270464 0.053954 -0.054554
C  1.436328 0.190056 -0.026314
C  0.445747 -2.470826 -0.464583
C  -2.888127 -2.311615 -0.446707
C  2.326947 -0.903935 -0.20488
C  -3.633429 0.420267 -0.001321
C  -0.899891 2.224356 0.313655
C  1.826699 -2.222933 -0.421701
C  -4.24744 -1.943986 -0.392344
C  -4.607323 -0.590325 -0.172163
C  3.819732 -0.724959 -0.176003
C  -2.134405 3.093212 0.469323
C  4.330406 0.706647 0.051594
H  1.78446 1.208585 0.140342
H  0.068612 -3.484941 -0.632375
H  -2.598325 -3.353825 -0.617141
H  -3.969094 1.442695 0.164277
H  2.555875 -3.02849 -0.55299
H  -5.028125 -2.700628 -0.520286
H  -5.666221 -0.312699 -0.132213
H  -2.759006 2.769574 1.320519
H  -2.75525 3.089568 -0.444096
H  -1.785913 4.119348 0.655406
H  3.975974 1.378769 -0.747119
H  3.988438 1.094011 1.025363
