program: Gaussian 09
title: 000280588
version: EM64L-G09RevD.01
frameworkgroup: C1[X(C16H13ClN2O2)]
method: RPBEPBE
basis: SDD
operation: Freq
keyword: #p
keyword: freq=noraman
keyword: PBEPBE/SDD
title: #p freq=noraman PBEPBE/SDD
converged: YES YES NO NO
title: Mulliken charges:
elementType: Cl O O N N C C C C C C C C C C C C C C C C H H H H H H H H H H H H H
charge: -0.076067 -0.211632 -0.201921 -0.216275 -0.379726 -0.467145 0.190623 0.190261 0.103130 0.110039 0.334226 -0.352696 -0.350463 0.307309 -0.208597 -0.209014 -0.293305 -0.379919 -0.843486 -0.132222 -0.285091 0.263840 0.271669 0.333346 0.269525 0.272484 0.290791 0.240354 0.241286 0.230773 0.234332 0.239959 0.230017 0.253595
chargesum: 0.00000
title: Mulliken charges with hydrogens summed into heavy atoms:
elementType: Cl O O N N C C C C C C C C C C C C C C C C
charge: -0.076067 -0.211632 -0.201921 -0.216275 -0.046379 0.068364 0.190623 0.190261 0.103130 0.110039 0.334226 -0.083171 -0.077979 0.307309 0.031757 0.032272 -0.002514 -0.149146 -0.139177 -0.132222 -0.031496
polarizability: 2.26234306e+02 -3.79992253e+00 2.35654570e+02 9.99725529e+00 8.00966584e+00 1.37511641e+02
1716.lowfreq: -6.1775 -0.0014 0.0012 0.0013 2.0477 4.6853 17.9616 27.5112 37.3352
frequency: 17.7986 27.4450 37.3210 77.4757 105.8197 114.8607 139.5007 151.8309 180.0005 186.6177 220.1124 240.7266 244.3651 263.0801 307.4886 324.5088 341.6457 357.5015 391.2940 412.8735 448.0946 454.7941 487.3372 501.4455 523.2307 541.7995 566.0557 580.7074 614.9369 635.9653 659.5345 682.7232 696.3484 714.3140 726.3249 753.3376 787.7950 793.0539 797.9614 839.7614 857.3513 868.7260 908.2237 919.6550 927.8669 976.2246 978.0870 985.7326 1008.1349 1014.4796 1042.5775 1072.2695 1077.1381 1090.9232 1126.5847 1159.0402 1165.1224 1172.3748 1190.6959 1196.7266 1265.9714 1282.7311 1285.3172 1305.5134 1325.6642 1377.9977 1392.3211 1397.6456 1417.1817 1421.1986 1453.8834 1454.1023 1459.0844 1467.4362 1474.9205 1486.0158 1517.1388 1586.5171 1613.4364 1615.1880 1618.1695 1627.8113 1674.9489 2952.4923 3020.4885 3033.1984 3087.8009 3094.4266 3130.1201 3140.9584 3154.1727 3158.3287 3165.5369 3175.5534 3179.5188 3570.3605
redmass: 7.8882 5.4924 7.6357 7.3477 4.8275 5.9447 5.1055 7.0814 6.6502 1.1219 3.7154 6.0093 5.8258 3.9994 3.5552 6.3537 3.7116 10.2255 3.7591 3.2185 2.9742 4.6514 1.8161 4.2392 7.0258 2.1263 4.6734 5.1826 7.0639 6.3260 4.7965 6.6027 5.2971 3.4167 3.1378 3.9268 5.1772 1.2842 1.7326 5.2390 5.7003 1.4480 1.3967 7.5352 1.3330 1.4189 2.5637 1.6807 1.3499 2.0874 1.5083 2.6677 3.3124 2.8557 1.7245 1.8997 1.4418 1.9760 2.2062 2.9653 3.1455 1.3596 1.4714 2.5596 1.4067 4.0561 1.5619 1.3007 5.5659 2.4580 2.5563 2.5038 1.3947 1.3170 1.0489 1.2996 2.1328 5.0309 7.4690 7.1033 7.7432 10.2835 11.8731 1.0403 1.0969 1.0589 1.0952 1.1064 1.0899 1.0865 1.0907 1.0927 1.0957 1.1004 1.0954 1.0762
irintensity: 0.3467 0.6420 0.4895 3.6114 0.3692 0.5383 0.0160 5.7784 0.5365 1.9003 0.2842 0.1395 0.7553 3.8283 2.0521 18.3034 2.7716 5.2176 5.6983 2.0228 12.9237 2.1455 39.5212 33.7849 6.9481 65.5889 14.6243 8.0585 52.3461 12.2889 0.3734 0.9361 17.1441 2.3728 97.5283 0.3586 1.0707 39.3964 23.8288 0.2732 65.5773 42.3635 0.0353 12.1006 0.1016 2.8554 40.7230 13.1821 0.0146 5.5067 5.9982 14.3440 44.4140 43.7380 11.3223 79.6541 0.3810 9.7032 38.1148 22.9939 480.9332 6.3173 5.4602 103.0030 14.5421 22.5263 34.2063 15.3564 8.7310 38.5493 5.5422 7.6841 14.9400 45.5304 13.1344 34.8309 153.0475 71.5560 22.4798 69.7658 141.7561 303.4501 79.0739 35.7074 24.2710 26.8885 18.3528 1.9650 17.7121 1.6416 4.7822 2.4482 4.9794 20.0332 3.3511 29.7766
temp: 298.150 k
press: 1.00000 atm
elementType: 17 8 8 7 7 6 6 6 6 6 6 6 6 6 6 6 6 6 6 6 6 1 1 1 1 1 1 1 1 1 1 1 1 1
symmnumber: 1
zpe: 670320.7 jmol-1
zpe.correction: 0.255312 hartree
zpe.thermalcorrener: 0.273457 hartree
zpe.thermalcorrenthalpy: 0.274402 hartree
zpe.thermalcorrgfe: 0.207317 hartree
zpe.sumelectzpe: -1336.084430 hartree
zpe.sumelectthermal: -1336.066284 hartree
zpe.sumelectthermalent: -1336.065340 hartree
zpe.sumelectthermalfe: -1336.132425 hartree
dipole: -3.7626 -2.3804 -1.4498
dipole: 4.6824
quadrupole: -110.1411 -132.0872 -125.3557
quadrupole: -16.3699 3.4696 -3.8910
quadrupole: 12.3869 -9.5592 -2.8277 -16.3699 3.4696 -3.8910
hfenergy: -1336.3397418 hartree
pointgroup: C01 [X(C16H13Cl1N2O2)]
dipole: 1.4831739 -0.9556085 -0.5298464 debye
polarizability: 227.6779905|2.7883905|185.0837704|1.9514435|50.1552903|186.6387563 unknown
InChI: InChI=1S/C16H13ClN2O2/c1-10-6-7-11(17)8-14(10)18-9-19-15(20)12-4-2-3-5-13(12)16(19)21/h2-8,18H,9H2,1H3
charge 0 multiplicity 1
34 atoms
Cl -3.082228 1.766453 3.036703
O  1.524555 -1.412179 -2.11117
O  0.700181 2.465696 0.424698
N  0.819901 0.569086 -1.008758
N  -1.428984 -0.317052 -1.493583
C  -0.466308 0.730337 -1.741857
C  2.853076 -0.318193 -0.299422
C  2.601606 0.850173 0.463553
C  1.713907 -0.512596 -1.252945
C  1.295063 1.436072 0.021751
C  -2.236274 -0.416542 -0.344094
C  4.012526 -1.082888 -0.103031
C  3.498448 1.290051 1.447637
C  -3.094127 -1.559281 -0.20744
C  4.927651 -0.645305 0.890196
C  4.674484 0.522254 1.653881
C  -2.234562 0.593749 0.658509
C  -3.927257 -1.64593 0.927532
C  -3.105178 -2.64184 -1.271155
C  -3.094432 0.454727 1.760752
C  -3.949834 -0.646305 1.929917
H  -0.858203 1.720574 -1.454592
H  -0.230982 0.736119 -2.819329
H  -1.325502 -1.155204 -2.065158
H  4.197839 -1.983186 -0.697133
H  3.290869 2.19154 2.032371
H  -1.575625 1.464355 0.597321
H  5.843666 -1.217361 1.072163
H  5.398351 0.833404 2.414491
H  -4.58465 -2.516853 1.033922
H  -3.404507 -2.243038 -2.261205
H  -3.817091 -3.441847 -1.009573
H  -2.11124 -3.119983 -1.393297
H  -4.60354 -0.727505 2.801545
