program: Gaussian 09
title: 000280572
version: EM64L-G09RevD.01
frameworkgroup: C1[X(C11H9N3O3S)]
method: RPBEPBE
basis: SDD
operation: Freq
keyword: #p
keyword: freq=noraman
keyword: PBEPBE/SDD
title: #p freq=noraman PBEPBE/SDD
converged: YES YES NO NO
title: Mulliken charges:
elementType: S O O O N N N C C C C C C C C C C C H H H H H H H H H
charge: 0.288455 -0.229734 -0.203035 -0.203540 0.021613 -0.008953 -0.009368 0.464016 -0.501356 0.387091 -0.368864 -0.391086 0.404201 -0.359143 -0.180101 -0.338098 -0.675403 -0.464421 0.287793 0.268600 0.220791 0.244543 0.289899 0.241713 0.254350 0.285559 0.274477
chargesum: 0.00000
title: Mulliken charges with hydrogens summed into heavy atoms:
elementType: S O O O N N N C C C C C C C C C C C
charge: 0.288455 -0.229734 -0.203035 -0.203540 0.021613 -0.008953 -0.009368 0.464016 -0.213563 0.387091 -0.100264 0.074248 0.404201 -0.069244 0.061612 -0.083748 -0.389844 -0.189944
polarizability: 2.67539345e+02 -2.14562946e+01 1.61682330e+02 -5.55136352e+00 -1.97297316e+01 1.15187559e+02
1716.lowfreq: -4.8134 -2.5704 -0.0019 -0.0019 -0.0018 3.5169 13.0480 17.3895 21.2819
frequency: 12.9362 17.2078 21.2290 51.8174 76.4931 85.3609 151.9244 172.6773 178.0990 193.3282 258.9014 285.8781 308.1955 324.9337 357.3864 401.2982 424.7404 468.3515 499.3455 533.5182 539.5376 560.1164 604.9484 623.4709 664.8790 685.6527 703.5739 705.9378 740.2556 762.5450 769.9117 811.9534 824.2433 824.5095 872.6847 886.8909 903.8319 917.1419 941.3730 954.9817 963.0150 986.9941 991.6957 1005.6686 1083.9704 1091.5668 1137.1862 1173.7205 1201.4300 1209.9958 1227.3683 1232.6614 1298.1327 1317.8950 1334.1971 1340.0064 1373.6128 1393.1700 1433.5309 1435.6065 1444.5362 1478.3671 1506.5923 1553.1657 1586.6450 1616.6479 3041.4458 3072.3848 3123.5946 3149.8091 3167.5055 3170.2350 3188.8813 3230.3422 3249.7388
redmass: 7.4672 5.8919 8.6369 12.8475 6.0096 5.5340 8.0118 6.3485 6.4736 4.2973 7.0634 5.1266 5.7921 2.5040 8.6934 7.4166 3.2638 4.5225 5.9164 4.8800 5.8637 7.0315 7.2535 6.5625 8.7353 2.3052 5.2838 5.7233 1.2492 3.3674 8.3519 1.9113 1.4631 3.2800 6.1131 4.7669 4.4435 1.4108 5.1721 1.3956 1.5602 5.7967 2.0692 1.3630 1.7602 1.6842 1.3865 1.1403 1.4783 3.7400 1.1913 2.7029 1.3712 1.8082 1.8780 1.5119 10.2821 5.3511 3.3960 1.5880 2.8753 2.8259 7.3873 6.5013 6.5820 7.0206 1.0593 1.0899 1.1065 1.0878 1.0922 1.0946 1.0966 1.0963 1.0968
irintensity: 0.9926 0.7906 0.2312 0.3983 3.1093 0.3642 4.7748 1.3393 0.8279 8.9601 1.4071 1.1507 2.3772 3.7309 1.8478 0.2809 0.5530 1.1546 25.1919 6.9669 17.7839 35.6816 18.7352 6.6307 31.3238 22.9171 21.4582 6.4074 0.8744 46.3599 29.7803 96.1749 33.4202 15.9245 20.9547 71.3531 64.1611 0.0414 268.7850 1.5816 56.0737 0.1735 1.7793 1.8089 11.4693 28.1518 11.4543 17.9490 7.9497 211.5526 1.9659 81.3616 1.2437 13.1050 3.5040 6.0754 109.2659 9.4448 21.4001 32.2834 36.1196 22.9484 3.8902 28.1315 2.8802 3.1386 41.7915 8.3930 3.0558 5.7412 2.3519 7.1455 4.9284 0.1637 1.5600
temp: 298.150 k
press: 1.00000 atm
elementType: 16 8 8 8 7 7 7 6 6 6 6 6 6 6 6 6 6 6 1 1 1 1 1 1 1 1 1
symmnumber: 1
zpe: 490070.4 jmol-1
zpe.correction: 0.186658 hartree
zpe.thermalcorrener: 0.202690 hartree
zpe.thermalcorrenthalpy: 0.203634 hartree
zpe.thermalcorrgfe: 0.138431 hartree
zpe.sumelectzpe: -1211.117876 hartree
zpe.sumelectthermal: -1211.101844 hartree
zpe.sumelectthermalent: -1211.100899 hartree
zpe.sumelectthermalfe: -1211.166103 hartree
dipole: 4.2049 2.6442 -2.6545
dipole: 5.6320
quadrupole: -136.6180 -108.5603 -107.3688
quadrupole: -1.2139 11.3960 -1.1509
quadrupole: -19.1023 8.9554 10.1469 -1.2139 11.3960 -1.1509
hfenergy: -1211.3045336 hartree
pointgroup: C01 [X(C11H9N3O3S1)]
dipole: -1.516036 -1.6159222 0.0124095 debye
polarizability: 267.3263033|0.1612281|155.4204241|25.3864184|-22.7808806|121.6625059 unknown
InChI: InChI=1S/C11H9N3O3S/c15-14(16)11-3-1-2-9(4-11)5-13-17-6-10-7-18-8-12-10/h1-5,7-8H,6H2
charge 0 multiplicity 1
27 atoms
S  -4.894357 -1.063456 1.920182
O  -2.049546 0.56757 -1.654932
O  5.802353 0.549258 1.275954
O  4.632771 2.317635 0.436854
N  4.74069 1.072947 0.761901
N  -5.025711 0.592937 -0.16486
N  -1.008227 -0.234036 -1.038795
C  1.278895 -0.090592 -0.256028
C  2.402438 0.74432 -0.030518
C  3.569084 0.187255 0.529749
C  1.363775 -1.47235 0.088723
C  -3.286424 -0.260355 -1.769993
C  -4.033815 -0.362373 -0.470046
C  3.666552 -1.176453 0.87706
C  2.542817 -2.002183 0.647633
C  0.065782 0.501062 -0.839536
C  -3.825311 -1.322513 0.510492
C  -5.567579 0.382737 1.016753
H  2.385132 1.809688 -0.279931
H  0.494593 -2.112057 -0.092906
H  -3.000639 -1.252528 -2.156674
H  -3.890484 0.287045 -2.510437
H  4.594505 -1.560179 1.308362
H  2.593248 -3.064538 0.906728
H  0.077646 1.569937 -1.105458
H  -3.109383 -2.140905 0.503804
H  -6.356008 0.984324 1.467216
