program: Gaussian 09
title: 000280552
version: EM64L-G09RevD.01
frameworkgroup: C1[X(C20H30O4)]
method: RPBEPBE
basis: SDD
operation: Freq
keyword: #pfreq=noraman
keyword: PBEPBE/SDD
title: #p freq=noraman PBEPBE/SDD
converged: YES YES NO NO
title: Mulliken charges:
elementType: O O O O C C C C C C C C C C C C C C C C C C C C H H H H H H H H H H H H H H H H H H H H H H H H H H H H H H
charge: -0.218551 -0.268682 -0.245706 -0.437373 -0.385351 -0.386031 -0.385272 -0.374606 -0.371267 -0.384068 -0.388561 -0.376636 -0.534397 -0.516654 0.108644 0.294058 0.253715 -0.336306 -0.347439 0.360635 -0.388685 -0.411054 -0.437369 -0.507331 0.191208 0.193698 0.191864 0.197225 0.195415 0.196904 0.186352 0.197420 0.187463 0.187818 0.224292 0.185525 0.216846 0.219201 0.202401 0.221011 0.236216 0.234369 0.240965 0.245150 0.247932 0.278436 0.271193 0.236549 0.202726 0.241492 0.232955 0.240243 0.241169 0.340246
chargesum: 0.00000
title: Mulliken charges with hydrogens summed into heavy atoms:
elementType: O O O O C C C C C C C C C C C C C C C C C C C C
charge: -0.218551 -0.268682 -0.245706 -0.097127 -0.000445 0.003059 0.007047 0.009166 0.004014 0.025749 0.047486 0.046777 -0.063812 -0.030538 0.108644 0.294058 0.253715 -0.088374 -0.069003 0.360635 -0.117491 -0.174505 0.006849 0.207036
polarizability: 3.28901802e+02 2.06194448e+01 2.13328214e+02 -6.80671223e+00 -5.50659796e+00 1.59806800e+02
1716.lowfreq: -20.5506 -10.2470 -3.5793 -3.2369 -0.0011 -0.0007 0.0014 5.7968 13.2385
frequency: -13.2869 5.3504 12.3387 21.0329 24.8142 39.0086 41.6458 49.8864 55.9507 74.1120 83.9643 92.7927 103.7639 106.3545 113.3285 125.7103 131.9565 142.2934 151.8678 176.4009 180.9024 203.3267 219.7553 251.7931 261.4978 280.1480 309.1474 348.6886 358.2770 363.6399 403.9922 422.5111 435.3370 462.8708 482.4831 490.0366 522.2302 552.5534 567.8447 620.1872 627.4250 631.3450 715.9774 719.5386 724.5050 733.8194 754.0527 758.8030 790.3873 806.4405 821.4494 841.3535 857.0456 859.7050 885.3285 927.0083 947.0883 954.2333 965.2569 975.6030 987.9368 988.7780 998.1753 1003.1462 1007.4192 1014.3642 1028.9813 1052.4517 1065.6388 1080.1053 1081.2762 1082.2464 1095.7050 1099.7291 1104.5714 1112.9413 1115.8747 1147.0558 1151.6734 1159.7827 1179.9549 1185.5836 1197.0116 1203.3738 1213.3402 1224.9214 1231.7630 1252.2352 1262.0174 1276.1821 1279.6193 1284.5334 1287.0265 1290.5611 1294.6839 1296.4640 1307.7558 1315.9563 1334.7542 1345.8529 1351.5691 1354.6061 1355.2600 1359.6499 1360.9380 1391.2746 1408.8435 1422.1597 1432.3960 1437.2930 1453.0111 1455.1493 1458.4671 1458.9903 1461.6751 1462.4156 1464.7107 1464.8519 1472.7714 1480.6872 1486.2985 1498.3265 1563.3032 1595.6854 1620.5470 1646.7766 2947.2172 2949.7677 2950.9748 2955.0411 2956.4755 2959.3504 2960.0311 2964.4394 2980.3905 2983.1167 2988.3423 2992.6748 2994.8837 2997.2547 3001.6451 3003.3127 3012.6612 3025.1034 3037.3482 3047.7871 3048.1937 3058.1920 3060.9432 3104.3876 3121.8017 3139.1453 3147.6157 3156.8130 3161.1622 3555.2532
redmass: 3.7491 4.9764 4.8373 4.6584 4.3213 1.8643 5.2341 3.6650 4.1737 4.1119 2.1737 2.4958 1.1799 2.6149 3.8462 2.0463 3.4108 2.3412 1.9856 4.4039 3.4254 2.8723 3.6462 3.0084 3.4556 5.0418 4.3465 2.6231 2.7572 1.8416 2.8353 3.5937 3.2245 3.1737 3.8717 4.1409 3.2157 3.2339 2.2532 4.8364 3.0609 6.6711 1.2699 1.1972 1.6023 1.3059 2.4006 1.9394 1.7508 3.8691 1.8556 1.6363 1.8295 1.2977 1.5572 3.2815 1.6417 1.8502 5.9956 2.0289 2.3334 2.8189 1.3782 4.3946 1.3678 2.6539 2.6261 3.5190 2.4531 2.0374 2.3685 1.9324 1.4383 3.3730 2.6075 1.2818 1.3805 1.6051 2.1875 1.1142 1.2804 1.2454 1.6181 1.5897 2.4890 1.5355 1.4158 1.4377 1.3054 1.0901 1.2675 1.1721 1.1164 1.3544 1.1106 1.1275 1.4187 1.3332 1.4710 1.5678 1.5595 1.6517 1.4786 1.6619 1.5704 2.9631 3.2562 1.1886 1.1024 1.0885 1.0503 1.0782 1.0816 1.0665 1.0885 1.0588 1.0851 1.0566 1.0980 1.1008 1.1011 2.4677 7.1130 7.9433 6.4831 8.8186 1.0588 1.0587 1.0589 1.0599 1.0600 1.0670 1.0608 1.0597 1.0630 1.0954 1.0969 1.0642 1.0603 1.0979 1.0975 1.0296 1.1009 1.1031 1.1044 1.0949 1.1012 1.1033 1.0990 1.1045 1.0893 1.0873 1.1047 1.0946 1.0965 1.0662
irintensity: 0.7156 0.1016 0.1980 0.8198 0.3423 1.2727 3.5348 3.9695 0.7636 0.1029 0.5908 0.3003 0.3549 0.7735 0.9980 0.7766 0.8230 0.4267 0.2053 0.4354 11.5863 3.5734 5.5561 14.6398 7.4098 0.4665 11.6173 43.3034 10.2495 112.0144 0.1141 19.2819 53.5040 1.0805 5.1887 9.5966 0.0606 3.1544 7.5788 3.8783 1.5055 0.8700 11.4995 9.7103 1.2455 17.0977 8.8135 2.5580 24.2088 7.5079 13.4103 26.8719 7.7468 7.2084 0.5775 4.2009 24.1231 52.6348 40.3580 34.5841 5.0057 6.9052 1.0099 10.3493 1.6400 1.4649 15.5711 1.2802 1.7082 0.1630 0.0908 3.1272 4.1843 15.4393 133.0113 1.8144 11.5027 20.4832 152.4925 19.2718 12.2396 34.6989 5.8739 28.8051 22.0550 55.3323 13.8242 48.5956 2.3950 6.4051 28.2766 9.0713 11.8957 1.0871 0.8286 6.1551 19.9478 4.9848 26.7521 34.4331 8.1605 6.4212 42.8074 16.1534 1.3455 3.8257 21.5651 19.1136 13.6621 28.5314 14.2620 6.2677 1.3872 0.6330 8.2554 0.7589 1.1858 10.5508 5.5264 0.1943 28.8340 2.9139 72.0216 82.9355 18.9461 151.3145 4.7952 0.8376 3.9536 1.3314 30.5719 53.8504 3.7360 163.4385 40.0850 5.1073 2.8487 29.9908 30.4556 6.6823 4.8985 32.8777 1.8240 1.0903 78.6296 13.6376 60.2326 83.6764 72.3025 28.9902 15.1135 5.3557 17.9111 13.3737 2.1324 7.9223
temp: 298.150 k
press: 1.00000 atm
elementType: 8 8 8 8 6 6 6 6 6 6 6 6 6 6 6 6 6 6 6 6 6 6 6 6 1 1 1 1 1 1 1 1 1 1 1 1 1 1 1 1 1 1 1 1 1 1 1 1 1 1 1 1 1 1
symmnumber: 1
zpe: 1204678.9 jmol-1
zpe.correction: 0.458838 hartree
zpe.thermalcorrener: 0.485842 hartree
zpe.thermalcorrenthalpy: 0.486786 hartree
zpe.thermalcorrgfe: 0.394292 hartree
zpe.sumelectzpe: -1079.156258 hartree
zpe.sumelectthermal: -1079.129255 hartree
zpe.sumelectthermalent: -1079.128310 hartree
zpe.sumelectthermalfe: -1079.220804 hartree
dipole: 0.4729 -0.8956 -0.2042
dipole: 1.0331
quadrupole: -121.3800 -151.2830 -145.5806
quadrupole: 0.1163 -11.4736 4.7402
quadrupole: 18.0345 -11.8685 -6.1660 0.1163 -11.4736 4.7402
hfenergy: -1079.6150961 hartree
pointgroup: C01 [X(C20H30O4)]
dipole: -0.192833 0.3568441 -0.0262799 debye
polarizability: 328.1844106|21.6106867|211.2739787|9.1208507|13.2909148|162.5784271 unknown
InChI: InChI=1S/C20H30O4/c1-24-20(23)11-9-7-5-3-2-4-6-8-10-19(22)18-14-12-17(16-21)13-15-18/h12-15,21H,2-11,16H2,1H3
charge 0 multiplicity 1
54 atoms
O  3.852349 -2.149283 -0.807862
O  -10.110505 -0.921443 -0.029393
O  -8.659779 -0.158995 1.623875
O  9.782422 1.858329 1.338952
C  -2.194819 0.772039 -0.285485
C  -3.589811 0.142788 -0.500223
C  -1.036084 -0.234189 -0.465782
C  -4.748998 1.149267 -0.323259
C  0.359586 0.393627 -0.251052
C  -6.142148 0.519188 -0.544457
C  1.510656 -0.616677 -0.450311
C  -7.293572 1.533144 -0.359875
C  2.895468 0.016388 -0.221802
C  -8.6912 0.927924 -0.609698
C  4.060413 -0.952067 -0.449478
C  5.467103 -0.455014 -0.245201
C  -9.104957 -0.075721 0.456479
C  5.761976 0.87084 0.173554
C  6.54425 -1.352471 -0.477968
C  8.168854 0.390686 0.113199
C  7.096546 1.287842 0.351539
C  7.875946 -0.936112 -0.296756
C  9.611341 0.848933 0.284173
C  -10.637953 -1.913903 0.938781
H  -2.060954 1.616002 -0.994535
H  -2.144516 1.211069 0.733096
H  -3.63938 -0.298486 -1.517889
H  -3.725398 -0.699034 0.210262
H  -1.086564 -0.672664 -1.484305
H  -1.16985 -1.078571 0.241981
H  -4.610763 1.99507 -1.029542
H  -4.703878 1.583971 0.697011
H  0.487246 1.245391 -0.952377
H  0.412176 0.822669 0.77212
H  -6.279274 -0.320175 0.165715
H  -6.190573 0.086793 -1.566219
H  1.384023 -1.475082 0.236871
H  1.468426 -1.042135 -1.471052
H  -7.149502 2.383973 -1.055063
H  -7.257127 1.942616 0.667884
H  3.030733 0.891625 -0.89215
H  2.965328 0.420911 0.809904
H  -8.752754 0.436666 -1.597853
H  -9.460582 1.726735 -0.614039
H  4.951859 1.583186 0.360734
H  6.302968 -2.372952 -0.793754
H  7.324616 2.310114 0.671567
H  8.696238 -1.643068 -0.47312
H  10.270564 -0.028315 0.456406
H  9.967817 1.36233 -0.626896
H  -11.409762 -2.464877 0.383383
H  -11.067266 -1.402519 1.816891
H  -9.831142 -2.587518 1.273404
H  9.463002 1.480654 2.197816
