program: Gaussian 09
title: 000280510
version: EM64L-G09RevD.01
frameworkgroup: C1[X(C13H7Cl2NO)]
method: RPBEPBE
basis: SDD
operation: Freq
keyword: #p
keyword: freq=noraman
keyword: PBEPBE/SDD
title: #p freq=noraman PBEPBE/SDD
converged: YES YES NO YES
title: Mulliken charges:
elementType: Cl Cl O N C C C C C C C C C C C C C H H H H H H H
charge: -0.063756 -0.040812 -0.255730 -0.439967 0.275224 0.472042 0.302146 0.088919 -0.009754 -0.331132 -0.325456 -0.376194 -0.344451 -0.284111 -0.227969 -0.108345 -0.238339 0.339536 0.252490 0.258911 0.287718 0.259497 0.263019 0.246515
chargesum: 0.00000
title: Mulliken charges with hydrogens summed into heavy atoms:
elementType: Cl Cl O N C C C C C C C C C C C C C
charge: -0.063756 -0.040812 -0.255730 -0.100431 0.275224 0.472042 0.302146 0.088919 -0.009754 -0.078642 -0.325456 -0.117283 -0.056733 -0.024614 0.035050 -0.108345 0.008175
polarizability: 2.83065825e+02 -1.34867619e+01 1.96447237e+02 -1.12780280e-02 -1.82511812e-02 6.18523301e+01
1716.lowfreq: -6.2386 -0.0028 -0.0002 0.0020 2.5658 5.3719 20.4037 54.2440 96.3843
frequency: 20.3113 54.2272 96.3838 146.3415 181.8404 204.6237 221.8908 247.7622 259.1674 326.9748 336.0842 358.8877 383.4828 436.9791 440.1038 479.7409 495.2227 507.3626 540.3089 586.5978 619.7559 658.0283 663.1094 709.0127 714.9362 741.5755 748.5986 770.9933 794.5172 811.8586 827.5435 860.9804 912.0403 940.1884 951.4899 983.8096 1003.2457 1085.4239 1087.6669 1101.3988 1140.7149 1161.1571 1198.5984 1247.8080 1259.7489 1293.1883 1319.2175 1357.6738 1359.3269 1396.5933 1418.6299 1429.9782 1469.8917 1492.1270 1546.8703 1579.7382 1598.4572 1614.6796 1630.0894 3152.8620 3153.1536 3167.5356 3177.0318 3181.1182 3232.9102 3516.1038
redmass: 6.1646 6.6509 10.1536 15.3734 4.8247 6.6966 16.0570 4.7618 13.6368 10.2508 5.2027 6.3314 9.4747 3.1734 8.2060 4.4238 8.1425 7.9139 4.0280 3.9301 6.1615 7.5724 2.4298 7.4677 2.5428 6.4291 2.1810 1.7934 7.5063 1.4757 2.4624 1.6020 5.2658 1.3733 1.3708 7.2463 1.3476 2.2865 4.4640 1.8777 2.0360 1.4160 1.4298 1.6401 2.5302 2.1856 2.6394 2.6108 5.8640 5.4071 2.7434 2.9320 3.7673 2.7843 6.6818 7.9539 6.7167 6.4382 5.3459 1.0872 1.0926 1.0926 1.0922 1.1001 1.0914 1.0766
irintensity: 0.5458 0.3637 3.4208 0.1555 0.1544 0.5793 3.6853 6.4655 1.1636 12.4956 0.9961 2.2210 5.5399 9.4918 5.8571 0.3698 0.5449 8.1205 0.3095 0.7122 19.0933 2.1580 26.8425 21.4307 0.0102 21.2404 25.9464 115.2085 29.0716 1.6207 33.2568 52.1877 29.6756 0.4289 0.2045 6.6571 1.7699 26.2932 60.2933 13.2736 6.3004 10.1662 6.3235 33.7972 18.1568 1.5888 73.2356 2.2262 45.0122 7.2601 34.2622 67.7576 0.8490 36.5547 48.1970 36.2581 40.6689 171.0816 351.4428 3.0121 1.3385 0.4992 0.4844 10.6605 10.8179 39.5199
temp: 298.150 k
press: 1.00000 atm
elementType: 17 17 8 7 6 6 6 6 6 6 6 6 6 6 6 6 6 1 1 1 1 1 1 1
symmnumber: 1
zpe: 433082.1 jmol-1
zpe.correction: 0.164952 hartree
zpe.thermalcorrener: 0.178233 hartree
zpe.thermalcorrenthalpy: 0.179177 hartree
zpe.thermalcorrgfe: 0.123420 hartree
zpe.sumelectzpe: -1548.566179 hartree
zpe.sumelectthermal: -1548.552899 hartree
zpe.sumelectthermalent: -1548.551955 hartree
zpe.sumelectthermalfe: -1548.607711 hartree
dipole: -0.6492 -1.3895 0.0006
dipole: 1.5337
quadrupole: -103.8876 -116.9058 -115.0635
quadrupole: 8.7869 0.0006 -0.0169
quadrupole: 8.0647 -4.9535 -3.1112 8.7869 0.0006 -0.0169
hfenergy: -1548.7311314 hartree
pointgroup: C01 [X(C13H7Cl2N1O1)]
dipole: 0.2066074 -0.5669436 0.0018856 debye
dipolederiv: -0.1819033 -0.168221 0.0006772 -0.0525769 -0.7135387 0.0025838 0.0000308 0.002588 -0.0653673 -1.0354716 0.0467628 -0.0004888 0.1136114 -0.1227045 0.0001974 -0.0006569 0.0001577 -0.060044 -0.7418757 -0.278551 0.0009185 -0.480933 -1.2588987 0.003201 0.0017855 0.003191 -0.3642095 -1.0694144 -0.6118283 0.0018975 -0.1542291 -0.5447442 0.0006998 0.0007538 0.000694 -0.2938985 -0.2421288 -0.0425313 0.0002313 -0.1666416 -0.167187 0.0004395 0.0004219 0.0004718 -0.0195768 0.5637192 -0.0991623 0.000671 -0.1421093 -0.1527873 0.0007584 0.0011626 0.0006885 0.0609944 0.4400605 0.4321662 -0.0012079 0.2737948 0.6079862 -0.001457 -0.0009297 -0.0015654 0.1176927 -0.0859846 0.2706701 -0.0010739 -0.0065388 -0.4369258 0.001607 -0.0001754 0.0017218 0.0054262 1.3893724 0.3783189 -0.0013369 0.2728971 1.4341191 -0.0046343 -0.0012795 -0.0046756 0.1906234 0.2864575 0.0176528 -0.0000304 0.2968327 0.0407919 -0.0001334 -0.0007688 -0.0004058 -0.113081 -0.1491046 0.4009308 -0.0017123 0.2317277 1.0000232 -0.0043407 -0.0010017 -0.0041274 -0.0759759 -0.4899967 -0.267506 0.000682 -0.065389 -0.0958974 -0.0002248 0.0000897 -0.0002473 -0.1637041 -0.1275703 -0.0807093 0.0002885 0.1786351 0.041004 -0.0004585 -0.0007878 -0.0004887 -0.1004254 -0.6505292 0.1197045 -0.0004079 0.2597866 -0.1032882 0.0001433 -0.0007222 -0.0000121 -0.1365403 0.0442753 -0.1065394 0.0004903 -0.0356779 -0.0971363 0.0000976 0.0002608 0.0000202 -0.0778406 1.4714959 -0.0242821 0.0005493 -0.3459017 0.3246086 -0.001054 0.0012482 -0.000959 -0.044668 0.0931512 0.012947 0.0000418 -0.0997294 -0.090357 -0.0003077 0.0004945 -0.0002783 -0.1598368 0.1249294 0.0005335 -0.0000098 -0.015711 0.1943361 0.000419 -0.0000187 0.0005848 0.3169998 0.159526 0.0089306 0.0001095 -0.0304627 0.0417915 0.0001685 0.0001672 0.0002824 0.1549644 0.0794455 0.0143694 -0.000077 0.0463933 -0.0370104 0.0006064 -0.0001059 0.0006617 0.1777924 0.115519 -0.0111409 0.000032 -0.0864361 0.044754 0.0003893 0.0003291 0.0003973 0.1574891 0.0314595 -0.0559124 0.0000432 -0.0652487 0.0163634 0.0003195 0.0001367 0.0003197 0.1713434 0.0710837 0.0454013 -0.0002053 0.0758479 -0.003461 0.0006518 -0.0003318 0.000665 0.1583915 -0.0965161 -0.0020037 -0.0000817 -0.0019413 0.0781587 0.0003282 -0.0001025 0.0003154 0.1634508 unknown
polarizability: 284.7539943|5.7285098|194.7575086|0.0709322|-0.4503093|61.8538892 unknown
InChI: InChI=1S/C13H7Cl2NO/c14-7-4-5-8-11(6-7)16-13(17)9-2-1-3-10(15)12(8)9/h1-6,16H
charge 0 multiplicity 1
24 atoms
Cl 1.108511 -3.382922 0.013639
Cl -5.23892 0.049918 -0.002224
O  1.549843 3.203129 -0.011062
N  -0.446057 2.032703 -0.006315
C  -0.585529 -0.426224 0.001014
C  0.897158 -0.484369 0.002069
C  -1.218058 0.865866 -0.00291
C  1.631626 0.76276 -0.002178
C  0.948144 2.085448 -0.006909
C  -1.463696 -1.550924 0.003175
C  1.732817 -1.649827 0.006841
C  -2.629761 1.010762 -0.00376
C  3.045473 0.822244 -0.001954
C  -2.863902 -1.425096 0.002176
C  3.138066 -1.59592 0.007185
C  -3.430571 -0.134617 -0.001115
C  3.807992 -0.352994 0.002681
H  -0.91643 2.942955 -0.009414
H  -1.05344 -2.557815 0.0056
H  -3.080001 2.008588 -0.006616
H  3.504891 1.815228 -0.005505
H  -3.500422 -2.313351 0.003876
H  3.703078 -2.532217 0.011043
H  4.901387 -0.320224 0.002961
