program: Gaussian 09
title: 000280507
version: EM64L-G09RevD.01
frameworkgroup: C1[X(C13H9ClN2O)]
method: RPBEPBE
basis: SDD
operation: Freq
keyword: #p
keyword: freq=noraman
keyword: PBEPBE/SDD
title: #p freq=noraman PBEPBE/SDD
converged: YES YES NO NO
title: Mulliken charges:
elementType: Cl O N N C C C C C C C C C C C C C H H H H H H H H H
charge: -0.072039 -0.265782 -0.457079 -0.701557 0.412395 0.335453 0.358645 0.092260 -0.025880 -0.299699 -0.679915 -0.368064 0.601500 -0.345406 -0.523551 -0.242934 -0.250071 0.332065 0.225794 0.249152 0.277049 0.253525 0.227444 0.234567 0.314398 0.317729
chargesum: 0.00000
title: Mulliken charges with hydrogens summed into heavy atoms:
elementType: Cl O N N C C C C C C C C C C C C C
charge: -0.072039 -0.265782 -0.125014 -0.069430 0.412395 0.335453 0.358645 0.092260 -0.025880 -0.299699 -0.454121 -0.118912 0.601500 -0.068357 -0.270026 -0.015491 -0.015504
polarizability: 2.86416149e+02 1.22937518e+01 1.98315971e+02 -2.50719815e-02 2.94362414e-02 6.37800603e+01
1716.lowfreq: -3.4422 0.0018 0.0018 0.0023 6.3700 9.3867 25.1821 74.9703 124.0442
frequency: 24.9392 74.9477 124.0406 169.1036 201.8261 202.1044 231.0183 245.6265 277.5642 320.8665 349.2685 379.8356 386.5739 410.0564 418.9986 423.6142 484.2439 492.5161 517.6650 558.9492 560.9993 615.5767 620.8150 650.4419 684.3013 717.9261 718.2733 739.4335 770.2445 785.1275 795.8455 831.7573 860.6281 866.9295 894.3354 981.2828 982.8551 1005.8685 1008.2577 1044.7623 1060.2710 1084.0921 1144.9670 1165.2580 1187.3369 1225.6151 1264.3861 1295.0184 1323.3616 1332.7098 1378.4335 1383.4911 1399.5862 1436.3444 1464.6074 1476.3580 1517.4710 1553.6559 1574.2538 1612.4987 1630.3063 1641.9057 1651.2381 3124.8485 3133.2073 3149.8385 3160.9109 3167.8794 3232.8018 3516.6881 3566.3651 3705.5797
redmass: 8.0616 4.5576 6.0621 5.0658 7.1677 5.1668 6.2773 4.6232 5.9604 10.2532 4.6544 1.0396 7.7125 1.2462 5.5309 3.3817 7.1623 6.6635 4.1113 4.3082 6.7518 2.3163 5.7525 2.3573 5.7098 6.7031 2.4375 1.6879 5.9699 1.8502 2.9445 1.4566 2.3106 7.8937 1.5112 1.3793 6.9294 1.3382 3.6056 1.5924 2.0375 2.9797 2.2302 1.5990 1.2445 1.3848 1.9192 2.4184 2.3459 4.2493 3.4469 6.0846 2.9208 3.0249 2.6754 3.3369 4.6028 6.4642 6.7682 5.7885 4.7538 1.7430 2.3827 1.0916 1.0869 1.0912 1.0926 1.0993 1.0910 1.0762 1.0452 1.1041
irintensity: 3.7562 0.5693 0.6072 4.0562 1.1826 0.3301 1.1298 6.6196 0.0303 12.7662 0.0577 0.9258 1.0930 305.1198 0.5887 4.0780 5.2107 12.0601 0.1181 0.0843 1.0733 0.0195 7.7542 1.9531 5.1407 11.1749 0.5492 153.0335 3.7528 23.0757 3.0546 0.3281 107.3613 44.5898 0.0734 2.9100 3.8362 0.4010 1.9531 10.7829 9.0002 4.9499 11.4918 6.0430 4.2114 34.7653 0.5471 6.3999 32.2737 173.9076 18.5302 14.0431 24.2993 1.7061 107.0881 11.9168 3.7579 64.6620 39.3052 103.0612 533.4447 47.8282 567.5228 15.6455 7.5686 8.7122 3.1226 25.4044 6.7667 28.6586 136.3497 25.2295
temp: 298.150 k
press: 1.00000 atm
elementType: 17 8 7 7 6 6 6 6 6 6 6 6 6 6 6 6 6 1 1 1 1 1 1 1 1 1
symmnumber: 1
zpe: 502376.0 jmol-1
zpe.correction: 0.191345 hartree
zpe.thermalcorrener: 0.204832 hartree
zpe.thermalcorrenthalpy: 0.205776 hartree
zpe.thermalcorrgfe: 0.150851 hartree
zpe.sumelectzpe: -1144.455941 hartree
zpe.sumelectthermal: -1144.442454 hartree
zpe.sumelectthermalent: -1144.441510 hartree
zpe.sumelectthermalfe: -1144.496435 hartree
dipole: -5.7569 0.1572 0.0111
dipole: 5.7591
quadrupole: -78.5562 -104.1742 -110.9216
quadrupole: 21.3632 -0.0165 -0.0044
quadrupole: 19.3278 -6.2902 -13.0376 21.3632 -0.0165 -0.0044
hfenergy: -1144.647286 hartree
pointgroup: C01 [X(C13H9Cl1N2O1)]
dipole: -2.253592 -0.2347947 -0.0070534 debye
dipolederiv: -0.1657837 0.0552659 -0.0001417 0.0049306 -0.7137981 -0.0006 -0.0000198 -0.0006956 -0.0760459 -0.8173562 -0.3587774 -0.0016042 -0.530373 -1.2002385 -0.003233 -0.0022497 -0.002951 -0.3730687 -1.1669994 -0.5088712 -0.0024937 -0.1585533 -0.4647649 -0.000736 -0.0016292 -0.001187 -0.2990458 -1.8919169 0.2943102 -0.0005565 0.4306152 -0.2016199 0.0014296 0.0005371 0.001132 -0.7304751 -0.6336685 0.0463398 -0.0007917 -0.1785765 -0.55943 -0.0011783 -0.001558 -0.0008089 -0.0385156 0.8022728 0.05818 0.0006091 -0.2461094 0.110178 0.0001852 -0.0006819 0.0004503 0.0395181 0.7906043 0.1306994 0.0015276 0.229273 0.6598067 0.0016552 0.0015965 0.0016419 0.1453699 -0.1471336 0.1693976 0.0004692 -0.0841806 -0.5136078 -0.001781 0.0000977 -0.0015047 -0.0020872 1.4559386 0.4298628 0.0028767 0.2957194 1.3992404 0.0042166 0.0029236 0.0044563 0.1852249 0.8718644 -0.0129089 0.0013438 0.2508984 1.11871 0.0012919 0.0022046 0.0013893 -0.0198003 -0.7920516 -0.0283663 -0.0007935 -0.3145558 -0.0081417 0.0002585 -0.0013952 0.0005333 -0.3012542 -0.4401706 0.0771827 0.000316 0.2530634 -0.0386204 0.0009063 0.0009291 0.0004898 -0.1593341 1.9878409 -0.2314464 0.0019476 -0.5698 0.3267106 -0.0004264 0.0018981 -0.0001479 0.1778123 -0.055603 -0.112549 -0.0003531 0.1968472 0.0842843 0.0008379 0.0006743 0.0004591 -0.1073207 -0.7752214 0.0424336 -0.0007182 0.612447 -0.3781574 0.0005716 0.0000606 -0.0002121 -0.2119228 0.2057149 -0.0280474 0.0001405 -0.0209147 0.1873983 0.001315 0.0000098 0.0012587 -0.13122 0.0213592 0.0101831 0.0003277 -0.1516829 -0.2028612 -0.000211 -0.0002979 -0.0001535 -0.1740565 0.1100207 0.013232 -0.0002589 0.0061669 0.1724987 -0.0003391 -0.0003157 -0.0004069 0.3104904 0.0358607 0.0283867 -0.0001584 0.0715466 -0.1082176 -0.0005183 -0.0002128 -0.0006366 0.1857802 0.1413 -0.0466105 -0.0004109 -0.0114501 0.0155363 -0.0007124 -0.0001159 -0.00065 0.1596493 0.0824477 -0.0272175 -0.0001699 -0.1034521 0.0381894 -0.0005121 -0.0004521 -0.0003602 0.1537726 -0.0158277 -0.0604589 -0.0003594 -0.0620829 0.0259545 -0.0003439 -0.0004878 -0.0001891 0.1790026 0.0369474 0.071657 0.0001819 0.1139931 -0.0899996 -0.0008675 0.0003408 -0.000892 0.1512594 -0.1365694 0.0287838 -0.0002328 0.0211129 0.0868279 -0.0002531 -0.0002095 -0.0002316 0.1621848 0.2225751 -0.0316283 -0.0003855 -0.1017034 0.1375253 -0.0004641 -0.001003 -0.0002123 0.3874385 0.2735554 -0.0090328 -0.0003117 0.0468212 0.1165968 -0.0004915 -0.0006436 -0.0005712 0.3866441 unknown
polarizability: 287.7752406|-5.4347534|196.9557981|0.2242823|0.3341835|63.7811419 unknown
InChI: InChI=1S/C13H9ClN2O/c14-10-5-7(15)6-11-12(10)8-3-1-2-4-9(8)13(17)16-11/h1-6,16H,15H2
charge 0 multiplicity 1
26 atoms
Cl -1.264274 -3.190739 -0.004883
O  2.002862 2.996033 0.011912
N  -0.098173 2.027236 0.005902
N  -4.720981 0.581649 -0.004354
C  -0.508618 -0.398932 -0.000672
C  0.961094 -0.596645 -0.000375
C  -1.006365 0.959836 0.001837
C  1.825741 0.556243 0.004321
C  1.297516 1.938379 0.007779
C  -1.558229 -1.372886 -0.003322
C  -2.379475 1.292948 0.000553
C  1.613796 -1.869412 -0.004945
C  -3.36406 0.28102 -0.002957
C  3.237874 0.428818 0.005336
C  -2.925869 -1.073985 -0.004689
C  3.01534 -1.983793 -0.003967
C  3.844743 -0.83516 0.001444
H  -0.466411 2.983144 0.007834
H  -2.674656 2.349202 0.002359
H  1.026914 -2.784656 -0.009543
H  3.823446 1.354002 0.009047
H  -3.654678 -1.88937 -0.006901
H  3.465016 -2.983222 -0.007544
H  4.935166 -0.933111 0.002319
H  -5.04386 1.544701 -0.003879
H  -5.417662 -0.157495 -0.007412
