program: Gaussian 09
title: 000280497
version: EM64L-G09RevD.01
frameworkgroup: C1[X(C14H8Cl2O4)]
method: RPBEPBE
basis: SDD
operation: Freq
keyword: #p
keyword: freq=noraman
keyword: PBEPBE/SDD
title: #p freq=noraman PBEPBE/SDD
converged: YES YES NO NO
title: Mulliken charges:
elementType: Cl Cl O O O O C C C C C C C C C C C C C C H H H H H H H H
charge: -0.044250 -0.044186 -0.442575 -0.442714 -0.241197 -0.241129 0.262797 0.263044 0.127661 0.127631 -0.348219 -0.348075 -0.282873 -0.282803 -0.224176 -0.224098 -0.107586 -0.107827 0.088940 0.088780 0.255487 0.255428 0.304944 0.304962 0.261424 0.261393 0.389615 0.389600
chargesum: 0.00000
title: Mulliken charges with hydrogens summed into heavy atoms:
elementType: Cl Cl O O O O C C C C C C C C C C C C C C
charge: -0.044250 -0.044186 -0.052959 -0.053114 -0.241197 -0.241129 0.262797 0.263044 0.127661 0.127631 -0.092731 -0.092647 0.022071 0.022159 0.037248 0.037294 -0.107586 -0.107827 0.088940 0.088780
polarizability: 2.86665079e+02 -5.27547116e-02 1.51029519e+02 -1.07991734e+01 2.13050592e-02 1.29598766e+02
1716.lowfreq: -3.9183 -3.6689 0.0015 0.0015 0.0030 2.2701 18.6235 34.6192 38.6000
frequency: 18.5979 34.6036 38.5903 45.7108 59.7644 115.3150 126.5294 142.1055 155.3627 160.4615 164.1496 209.6273 279.8275 285.2920 347.6414 352.8097 365.0884 368.4105 406.3569 418.4160 432.4547 448.9106 492.3432 548.0152 556.0874 582.7088 591.8198 596.2561 612.0000 613.1207 663.0252 694.7255 696.2805 700.0863 770.2922 774.2888 800.8505 826.2004 828.7126 838.6541 921.2306 921.5862 961.1190 964.6502 984.6413 1005.7685 1009.6293 1091.0107 1094.6465 1113.6663 1124.8842 1161.0601 1161.8867 1247.2165 1264.4176 1280.1265 1307.2749 1308.9652 1361.8359 1367.1715 1381.0762 1388.4843 1459.5020 1490.5955 1566.9113 1568.8240 1593.1416 1594.1098 1641.4076 1645.1356 3147.1711 3148.1707 3173.9659 3174.1765 3192.5397 3192.9703 3533.1224 3533.4291
redmass: 7.3995 12.1007 11.8460 12.2025 11.9396 5.8929 5.5587 9.1541 7.5839 6.7259 10.6676 13.9521 7.8907 7.8530 7.1771 6.5049 11.1649 9.6490 4.8394 3.4398 4.1073 5.4633 5.6346 3.4353 3.5649 7.0260 1.3627 1.2828 4.5427 3.7826 7.0022 5.3201 5.3480 5.7010 5.2396 4.8794 6.8711 6.5964 1.4117 1.4668 1.4565 1.4547 1.3662 1.3621 7.1674 4.6720 4.5878 2.1591 2.0283 1.9911 1.7137 1.5418 1.5088 1.9458 1.3534 1.8383 2.3705 2.2863 5.5772 6.5986 4.3984 4.9265 2.5384 3.2839 8.3772 9.1959 7.0903 7.0775 8.8791 8.8783 1.0894 1.0894 1.0966 1.0967 1.0928 1.0928 1.0642 1.0643
irintensity: 0.0167 0.2121 0.0137 0.7200 0.4891 1.2463 2.7105 0.2429 0.0498 0.1987 0.5793 0.7660 1.5374 0.0904 1.6208 1.7012 16.0536 3.3302 2.4484 2.0057 16.1255 11.4127 16.0418 28.5814 37.0354 5.3551 117.9516 85.6838 47.5258 59.8807 19.0283 19.7343 15.3884 2.3511 12.4517 5.0427 63.3674 12.0202 41.1899 24.4873 16.1973 9.7999 0.4067 0.7150 204.7662 195.5700 255.9366 18.9082 71.2006 85.2164 60.1130 62.9249 53.9409 1.3621 8.4636 0.0056 69.2465 80.9686 18.2553 21.6498 0.1844 0.0180 148.0969 3.4857 59.8062 14.6144 58.7921 0.1551 28.9787 456.5153 7.5194 1.7654 1.9966 2.9137 4.1370 4.0953 47.5944 59.6555
temp: 298.150 k
press: 1.00000 atm
elementType: 17 17 8 8 8 8 6 6 6 6 6 6 6 6 6 6 6 6 6 6 1 1 1 1 1 1 1 1
symmnumber: 1
zpe: 485917.2 jmol-1
zpe.correction: 0.185076 hartree
zpe.thermalcorrener: 0.202997 hartree
zpe.thermalcorrenthalpy: 0.203941 hartree
zpe.thermalcorrgfe: 0.136264 hartree
zpe.sumelectzpe: -1757.936368 hartree
zpe.sumelectthermal: -1757.918448 hartree
zpe.sumelectthermalent: -1757.917503 hartree
zpe.sumelectthermalfe: -1757.985180 hartree
dipole: -0.0003 -0.7243 0.0046
dipole: 0.7243
quadrupole: -144.9715 -113.2748 -118.7129
quadrupole: 0.0013 4.7424 0.0138
quadrupole: -19.3185 12.3782 6.9402 0.0013 4.7424 0.0138
hfenergy: -1758.1214445 hartree
pointgroup: C01 [X(C14H8Cl2O4)]
dipole: 0.0008208 -0.0177897 0.2844024 debye
polarizability: 286.7216575|-10.3335806|129.6035204|-0.9632327|-1.1571407|150.9681859 unknown
InChI: InChI=1S/C14H8Cl2O4/c15-7-1-3-9(11(5-7)13(17)18)10-4-2-8(16)6-12(10)14(19)20/h1-6,17,19H
charge 0 multiplicity 1
28 atoms
Cl 5.381765 -0.387218 0.903945
Cl -5.371901 0.344578 0.968722
O  2.026903 2.395019 -1.973344
O  -2.028616 -2.110026 -2.20392
O  -0.183427 1.876146 -1.515209
O  0.18311 -1.627274 -1.7141
C  0.755281 -0.04421 0.555677
C  -0.746438 0.048501 0.563567
C  1.607485 0.747376 -0.272614
C  -1.602066 -0.648702 -0.342496
C  1.357209 -0.919121 1.493769
C  -1.344907 0.814785 1.594317
C  3.018008 0.639455 -0.161966
C  -3.012165 -0.555058 -0.214274
C  2.758852 -1.037683 1.60755
C  -2.746044 0.918727 1.726595
C  3.570583 -0.25051 0.769825
C  -3.561296 0.226864 0.811677
C  1.032807 1.687736 -1.275212
C  -1.031704 -1.473572 -1.444164
H  0.716008 -1.528532 2.138773
H  -0.701402 1.350527 2.299602
H  3.6526 1.250274 -0.807071
H  -3.649017 -1.092817 -0.919337
H  3.205573 -1.725974 2.330761
H  -3.18973 1.523445 2.522697
H  1.583937 2.994365 -2.631796
H  -1.588909 -2.633501 -2.926172
