program: Gaussian 09
title: 000280484
version: EM64L-G09RevD.01
frameworkgroup: C1[X(C14H12N4S)]
method: RPBEPBE
basis: SDD
operation: Freq
keyword: #p
keyword: freq=noraman
keyword: PBEPBE/SDD
title: #p freq=noraman PBEPBE/SDD
converged: NO YES NO NO
title: Mulliken charges:
elementType: S N N N N C C C C C C C C C C C C C C H H H H H H H H H H H H
charge: 0.153041 -0.392344 -0.392345 -0.103216 -0.103216 0.446001 0.446001 -0.108919 -0.108918 -0.454494 -0.454494 -0.322898 -0.322898 -0.197849 -0.197848 -0.228108 -0.228108 -0.255502 -0.255502 0.319098 0.319098 0.218098 0.218099 0.321556 0.321556 0.226358 0.226357 0.226821 0.226821 0.228877 0.228877
chargesum: 0.00000
title: Mulliken charges with hydrogens summed into heavy atoms:
elementType: S N N N N C C C C C C C C C C C C C C
charge: 0.153041 -0.073245 -0.073246 -0.103216 -0.103216 0.446001 0.446001 -0.108919 -0.108918 -0.236395 -0.236396 -0.001342 -0.001342 0.028508 0.028509 -0.001287 -0.001287 -0.026625 -0.026625
polarizability: 4.00583886e+02 -2.91264083e-05 2.04322619e+02 -3.21333203e-03 -1.38232541e-02 7.26431212e+01
1716.lowfreq: -4.2583 -0.0019 -0.0009 0.0002 1.4092 6.9153 28.1070 30.1493 56.4242
frequency: 28.1006 30.1483 56.4242 61.4871 62.9708 139.3245 139.8769 196.1877 215.5883 239.2319 260.4562 295.4084 339.4597 362.1804 410.2664 410.4190 475.0435 481.2245 518.5674 521.8788 533.2901 539.9204 543.1985 555.3624 568.7269 612.8832 615.9262 680.9555 696.4241 696.6273 760.3674 761.5441 762.1930 804.2219 810.8684 820.3067 839.9900 840.2965 913.7500 914.4253 970.0217 970.1153 983.3816 983.5109 1001.4460 1001.6986 1008.5854 1024.8671 1028.4772 1062.6755 1090.3690 1091.7486 1172.2090 1172.5913 1180.4985 1191.1920 1191.4759 1246.5905 1252.8783 1324.3332 1327.5072 1382.1753 1385.3734 1432.6627 1436.8258 1481.4482 1483.4351 1501.0056 1516.3123 1534.8873 1589.0904 1601.0581 1602.0698 1613.9436 1616.5841 3106.4754 3106.5076 3132.7064 3132.7437 3144.1292 3144.1705 3165.3302 3165.4111 3180.0455 3180.4004 3559.0349 3559.7640
redmass: 5.6010 4.0573 5.9637 4.7674 7.8036 6.3999 5.5620 7.8119 4.0291 3.5353 5.2667 14.4462 6.1767 9.1527 2.9491 2.9422 1.5283 1.7217 4.2869 12.4973 1.8020 8.9807 2.6333 9.9163 7.0390 6.4600 6.5494 8.6687 2.0416 2.0363 8.4949 1.6551 1.6491 8.8295 5.9230 5.9965 1.2675 1.2680 1.4073 1.4081 1.3466 1.3463 6.1755 6.1597 1.3026 1.3025 6.5813 2.4093 2.1890 3.9859 1.5712 1.6070 1.1028 1.0510 4.5503 1.1137 1.1275 2.5341 2.4366 1.3971 1.3790 5.5902 6.9247 2.2717 2.3207 2.4419 2.3606 1.7084 1.6830 6.8825 9.0224 4.7875 5.0861 6.0969 6.0207 1.0888 1.0888 1.0866 1.0866 1.0932 1.0932 1.0987 1.0987 1.0967 1.0966 1.0762 1.0763
irintensity: 1.9445 0.0000 0.0777 0.0000 1.4315 1.5973 4.2757 3.3265 0.0000 11.8065 0.9236 3.2915 0.0574 0.0000 0.0000 0.0050 0.0000 151.2778 0.0000 11.6387 31.8638 39.7231 0.0000 2.6400 2.6539 3.2181 0.0001 32.8978 78.6426 0.0000 0.1777 0.0001 190.1609 0.4747 1.1737 33.3708 0.0000 0.0179 0.0000 25.7666 0.0000 0.1714 3.3817 0.0005 0.0000 5.3191 54.0634 15.5112 13.4683 6.3067 44.5141 0.0000 2.5765 0.0066 3.3490 2.5048 4.0396 76.6521 28.6411 58.2381 2.0243 64.7938 2.7200 110.8506 0.0046 80.5657 30.4314 32.7238 66.9225 2090.5652 0.4778 47.3760 4.4963 138.2769 28.2598 5.8815 24.6220 0.0268 0.0143 12.1551 48.2184 41.4500 5.1627 32.8428 4.9555 44.7419 56.0291
temp: 298.150 k
press: 1.00000 atm
elementType: 16 7 7 7 7 6 6 6 6 6 6 6 6 6 6 6 6 6 6 1 1 1 1 1 1 1 1 1 1 1 1
symmnumber: 1
zpe: 613357.0 jmol-1
zpe.correction: 0.233615 hartree
zpe.thermalcorrener: 0.249660 hartree
zpe.thermalcorrenthalpy: 0.250604 hartree
zpe.thermalcorrgfe: 0.188051 hartree
zpe.sumelectzpe: -1156.409115 hartree
zpe.sumelectthermal: -1156.393070 hartree
zpe.sumelectthermalent: -1156.392126 hartree
zpe.sumelectthermalfe: -1156.454679 hartree
dipole: 0.0000 -3.7452 0.0013
dipole: 3.7452
quadrupole: -93.8289 -102.3571 -127.2086
quadrupole: 0.0000 -0.0019 0.0017
quadrupole: 13.9693 5.4411 -19.4104 0.0000 -0.0019 0.0017
hfenergy: -1156.6427301 hartree
pointgroup: C01[X(C14H12N4S1)]
dipole: 0.0000529 1.4734935 -0.0015859 debye
polarizability: 400.5483511|-0.0038629|204.3225317|3.4134915|-0.1082904|72.6787431 unknown
InChI: InChI=1S/C14H12N4S/c1-3-7-11(8-4-1)15-13-17-18-14(19-13)16-12-9-5-2-6-10-12/h1-10,15-16H
charge 0 multiplicity 1
31 atoms
S  -0.00011 2.292405 -0.002345
N  -2.587232 1.214068 -0.028325
N  2.586933 1.213936 0.025828
N  -0.701024 -0.316517 -0.00674
N  0.700609 -0.316553 0.007904
C  -3.700779 0.327177 -0.039387
C  3.700426 0.326987 0.037733
C  -1.24343 0.898232 -0.013796
C  1.243106 0.898168 0.012127
C  -4.995025 0.917178 -0.053836
C  4.994719 0.916923 0.050528
C  -3.567447 -1.086638 -0.036539
C  3.566996 -1.086822 0.037271
C  -6.144052 0.10286 -0.065347
C  6.143696 0.102546 0.062738
C  -4.731161 -1.885956 -0.048213
C  4.730663 -1.886199 0.049579
C  -6.020476 -1.307029 -0.062608
C  6.020024 -1.307337 0.062335
H  -2.818373 2.208096 -0.03154
H  2.818139 2.207952 0.027683
H  -5.099913 2.010488 -0.056025
H  5.099682 2.010228 0.05087
H  -2.56999 -1.53054 -0.025357
H  2.569501 -1.530671 0.027421
H  -7.135077 0.569829 -0.07648
H  7.13476 0.569464 0.072578
H  -4.622809 -2.976441 -0.045971
H  4.622236 -2.976679 0.049158
H  -6.913899 -1.94005 -0.071551
H  6.913409 -1.940403 0.071808
