program: Gaussian 09
title: 000280521
version: EM64L-G09RevD.01
frameworkgroup: C1[X(C19H22ClN5)]
method: RPBEPBE
basis: SDD
operation: Freq
keyword: #p
keyword: freq=noraman
keyword: PBEPBE/SDD
title: #p freq=noraman PBEPBE/SDD
converged: YES YES NO NO
title: Mulliken charges:
elementType: Cl N N N N N C C C C C C C C C C C C C C C C C C C H H H H H H H H H H H H H H H H H H H H H H
charge: -0.062531 -0.312445 -0.094594 -0.174063 -0.634275 -0.614017 0.188176 0.344023 -0.685672 -0.703081 0.232755 0.625223 -0.591916 -0.331725 -0.375266 -0.342891 -0.406685 -0.574841 -0.024727 0.508058 -0.422319 -0.392190 -0.224968 -0.230502 -0.241957 0.237186 0.231616 0.212375 0.241707 0.206161 0.227081 0.232528 0.253403 0.283170 0.261404 0.218461 0.235778 0.243328 0.334936 0.340992 0.230314 0.237931 0.316167 0.320354 0.224294 0.224936 0.228309
chargesum: 0.00000
title: Mulliken charges with hydrogens summed into heavy atoms:
elementType: Cl N N N N N C C C C C C C C C C C C C C C C C C C
charge: -0.062531 -0.312445 -0.094594 -0.174063 0.041653 0.022505 0.188176 0.344023 -0.004495 -0.028133 0.232755 0.625223 -0.105986 -0.048555 -0.113863 -0.342891 -0.163357 -0.120602 -0.024727 0.508058 -0.192005 -0.154259 -0.000674 -0.005566 -0.013648
polarizability: 4.03730707e+02 -1.94233364e+01 2.15143397e+02 -9.67905727e+00 -1.01004041e+01 1.73131920e+02
1716.lowfreq: -10.4496 -5.5511 -0.0009 -0.0008 -0.0006 3.1617 6.7443 17.9184 22.0814
frequency: 5.6638 17.4977 22.0470 23.2927 35.5785 63.4286 73.4011 89.8961 95.8105 119.8967 149.0707 178.7487 200.7559 210.0326 235.3649 248.8132 261.8609 276.2269 281.7732 303.3276 317.2289 331.3602 347.3380 370.0772 373.9388 382.0620 391.9897 403.2997 416.0400 451.8226 457.0584 494.4359 497.9660 505.6169 518.1855 520.4697 530.0121 539.8349 572.6564 593.4442 617.5690 629.9447 666.8943 669.0043 702.4300 709.4369 724.3144 724.8182 759.7511 783.2656 799.4661 811.0455 833.7674 853.0254 854.3043 867.1461 891.9750 908.7433 918.6486 946.0424 953.4642 968.1440 976.1169 988.0206 989.5013 991.1278 992.7797 1000.0603 1025.1520 1026.9412 1050.1174 1076.1111 1105.1459 1119.1770 1123.0073 1129.3460 1159.1113 1172.1007 1186.4278 1189.9733 1204.9884 1217.3559 1243.0053 1253.6557 1269.6156 1274.8712 1284.5879 1322.2307 1328.1856 1348.2611 1365.4088 1382.4339 1384.6912 1388.0269 1402.5550 1440.5900 1446.4222 1450.4937 1460.9072 1470.2353 1471.1207 1476.4503 1479.3624 1483.8820 1484.1760 1531.6053 1546.4489 1569.3804 1593.2733 1601.4466 1609.3735 1613.9971 1617.4648 2981.1727 2992.6187 2997.1555 3005.0150 3044.9056 3071.5713 3081.6024 3092.9021 3100.6855 3109.2961 3113.3450 3114.9964 3131.2689 3131.3484 3143.3426 3162.0626 3164.9017 3171.1633 3553.9216 3567.7735 3708.5670 3730.0215
redmass: 4.1757 5.1192 5.9768 4.8363 4.7844 4.0900 4.5374 4.7847 5.4738 4.4620 5.0455 5.2410 4.3930 5.2868 1.1583 3.4906 2.9540 1.0847 3.8496 2.5472 2.8491 2.6024 3.3816 3.7426 1.2256 1.2174 3.5203 2.8226 4.8848 3.2697 3.2701 2.2442 2.9128 2.2715 4.5399 1.5025 2.2032 1.9689 4.6574 4.6144 6.3588 4.3829 6.8919 7.2238 2.7911 2.2489 9.9702 5.0503 1.9409 1.2432 3.6905 4.1433 1.7880 2.7567 1.3045 2.4369 1.4624 1.5936 1.5210 1.9376 3.9130 1.4710 1.3913 1.6221 2.6546 2.0610 1.5348 2.9258 2.7014 2.2347 3.4750 1.5454 1.9452 2.0225 1.4130 2.0394 1.1340 1.0517 1.1143 3.4285 1.9275 2.4868 3.6240 1.6544 1.3677 1.9682 1.8585 1.3649 1.2697 3.8822 1.2338 7.9221 1.3233 3.7522 4.0965 2.1780 4.3548 1.0543 1.0827 1.1578 1.0976 1.0919 2.5209 1.5248 1.4510 2.5594 6.9685 1.7451 6.0542 3.9111 2.8669 6.0995 2.2963 1.0347 1.0590 1.0355 1.0599 1.1012 1.1046 1.1006 1.0997 1.1006 1.0993 1.0875 1.0871 1.0899 1.0898 1.0957 1.1014 1.0956 1.0933 1.0444 1.0437 1.1052 1.1058
irintensity: 0.2781 0.1302 0.0753 0.2388 0.1888 0.1080 0.3301 0.6331 0.0525 0.4089 0.0954 3.9943 3.0617 0.3704 0.0168 1.9321 0.9710 0.8521 0.6572 8.4808 1.4928 2.7077 11.1000 9.6707 101.2993 269.2848 1.3883 0.0725 26.2353 4.7062 0.8774 48.4126 14.6771 26.2209 2.5614 2.2916 22.8822 27.4719 4.5108 28.1240 0.1438 3.0472 1.0833 1.7346 47.9814 23.9429 34.7383 9.8970 45.8096 1.2458 7.0072 72.4368 30.6297 5.7449 0.5590 1.9739 3.8064 1.4099 2.6983 12.7429 19.7061 0.4127 0.0549 3.9123 0.1812 3.8749 0.4720 2.2391 17.4116 11.8757 15.3630 4.6825 5.9834 2.3036 7.9381 47.2970 7.9511 0.2380 0.3918 29.0824 8.7058 0.3519 24.5456 10.8592 10.5084 25.8413 51.7384 0.3590 0.4002 2.3587 33.5919 0.1288 21.2057 13.7539 463.5126 6.6932 142.7922 1.3082 7.3636 21.2409 2.3150 50.0365 103.5292 29.7694 10.6242 303.6533 25.9587 193.7768 1.6601 468.6507 236.3660 16.9123 468.2551 15.5829 7.9902 17.1385 39.9540 1.6948 15.5865 27.1576 13.2888 32.8833 31.0082 9.3508 8.8463 18.7411 2.7566 41.4871 29.5794 3.7487 2.2855 56.5831 90.7724 57.9713 37.4523
temp: 298.150 k
press: 1.00000 atm
elementType: 17 7 7 7 7 7 6 6 6 6 6 6 6 6 6 6 6 6 6 6 6 6 6 6 6 1 1 1 1 1 1 1 1 1 1 1 1 1 1 1 1 1 1 1 1 1 1
symmnumber: 1
zpe: 992822.0 jmol-1
zpe.correction: 0.378146 hartree
zpe.thermalcorrener: 0.402415 hartree
zpe.thermalcorrenthalpy: 0.403359 hartree
zpe.thermalcorrgfe: 0.320277 hartree
zpe.sumelectzpe: -1469.248854 hartree
zpe.sumelectthermal: -1469.224586 hartree
zpe.sumelectthermalent: -1469.223641 hartree
zpe.sumelectthermalfe: -1469.306723 hartree
dipole: -2.4642 -1.8730 -0.6103
dipole: 3.1548
quadrupole: -155.7752 -148.5237 -154.6457
quadrupole: -1.6161 -6.8947 0.0199
quadrupole: -2.7937 4.4578 -1.6642 -1.6161 -6.8947 0.0199
hfenergy: -1469.6270003 hartree
pointgroup: C01 [X(C19H22Cl1N5)]
dipole: 0.9702841 0.7677299 -0.0984372 debye
polarizability: 403.6971404|-21.1196911|209.9555794|5.4494277|17.1997189|178.3533048 unknown
InChI: InChI=1S/C19H22ClN5/c1-19(2)24-17(21)23-18(22)25(19)15-11-10-14(16(20)12-15)9-8-13-6-4-3-5-7-13/h3-7,10-12H,8-9,21-22H2,1-2H3
charge 0 multiplicity 1
47 atoms
Cl 1.420359 -2.298529 -1.244537
N  -3.079708 0.105093 0.005813
N  -5.370498 -0.192708 0.911489
N  -4.956221 1.067528 -1.155314
N  -2.795199 1.447749 -1.938148
N  -7.045909 1.082315 -0.121297
C  -4.042697 -0.81073 0.807631
C  -1.654157 0.026387 0.181117
C  -4.151237 -2.171822 0.063537
C  -3.488896 -1.008098 2.231191
C  -3.6414 0.856173 -1.021438
C  1.196396 -0.143354 0.557571
C  2.698685 -0.197484 0.755756
C  -0.894435 -0.9505 -0.516342
C  -0.986391 0.92228 1.05411
C  0.496339 -1.011236 -0.31543
C  0.407873 0.82766 1.234043
C  3.47834 0.563721 -0.368272
C  -5.749416 0.599241 -0.08431
C  4.983516 0.463349 -0.174115
C  5.71524 1.511072 0.440826
C  5.681676 -0.707134 -0.572332
C  7.108216 1.395249 0.654472
C  7.073163 -0.827277 -0.361824
C  7.791917 0.22427 0.254303
H  -4.888614 -2.806111 0.585244
H  -4.503115 -2.016124 -0.972074
H  -3.182237 -2.703729 0.046399
H  -4.214285 -1.623009 2.788604
H  -2.510138 -1.518594 2.232982
H  -3.400302 -0.037386 2.747419
H  2.963417 0.247382 1.732591
H  3.046436 -1.246354 0.768099
H  -1.391072 -1.645953 -1.198693
H  -1.573224 1.677224 1.586083
H  3.156826 1.622366 -0.366877
H  3.188158 0.132801 -1.34467
H  0.912979 1.516978 1.92086
H  -3.226711 2.05116 -2.633474
H  -1.796156 1.262994 -1.953498
H  5.191498 2.425057 0.748731
H  5.129957 -1.52338 -1.056079
H  -7.701329 0.798429 0.600657
H  -7.297222 1.756581 -0.837475
H  7.658763 2.216524 1.127514
H  7.597582 -1.735585 -0.680029
H  8.871835 0.133313 0.416386
