program: Gaussian 09
title: 000280475
version: EM64L-G09RevD.01
frameworkgroup: C1[X(C10H12N4O3)]
method: RPBEPBE
basis: SDD
operation: Freq
keyword: #p
keyword: freq=noraman
keyword: PBEPBE/SDD
title: #p freq=noraman PBEPBE/SDD
converged: YES YES NO NO
title: Mulliken charges:
elementType: O O O N N N N C C C C C C C C C C H H H H H H H H H H H H
charge: -0.245384 -0.221719 -0.221763 -0.078828 -0.017472 -0.172930 0.020222 -0.364708 -0.345245 -0.295795 -0.291449 0.185938 -0.329387 -0.273314 0.375796 -0.342172 -0.342743 0.240594 0.275831 0.244701 0.235818 0.204576 0.232245 0.231353 0.204108 0.253473 0.269795 0.285552 0.282908
chargesum: 0.00000
title: Mulliken charges with hydrogens summed into heavy atoms:
elementType: O O O N N N N C C C C C C C C C C
charge: -0.245384 -0.221719 -0.221763 -0.078828 -0.017472 -0.172930 0.020222 0.151717 0.135274 0.141025 0.144012 0.185938 -0.075914 -0.003520 0.375796 -0.056620 -0.059835
polarizability: 3.61697501e+02 4.18670869e+00 1.46592959e+02 9.89992790e+00 -9.33312468e-01 7.58224562e+01
1716.lowfreq: -12.6616 -0.0006 0.0004 0.0005 3.7520 6.5547 21.8259 31.7730 62.8220
frequency: 20.4762 31.0435 62.7721 67.8835 73.1129 166.9982 169.6766 204.0457 223.6717 262.4922 307.3703 331.2623 350.8332 383.1585 397.3403 415.8011 465.9783 486.5658 504.7560 511.9899 546.8972 596.6264 625.9938 664.8006 668.0591 745.5588 757.7654 788.4819 801.8155 828.7061 845.6054 872.2432 876.9862 924.4119 990.6571 993.3310 995.4925 999.1373 1000.7746 1045.9349 1068.5767 1093.1363 1095.1970 1105.5976 1148.8626 1159.8016 1178.3724 1189.1491 1209.5780 1224.4469 1270.0312 1276.7579 1288.5841 1308.6998 1320.7187 1342.6869 1350.1240 1352.3480 1367.9213 1380.2340 1401.4674 1433.5131 1448.1954 1451.0562 1456.7545 1459.7496 1471.8704 1579.8036 1605.1712 2959.3597 2964.0070 2982.8533 2990.1297 3086.4645 3089.8076 3094.1753 3096.6240 3161.5418 3166.1902 3184.9096 3188.2847
redmass: 4.5144 5.1096 6.2163 6.4473 6.9824 7.2062 4.7039 4.1961 3.2800 3.4250 4.5736 6.0597 5.3091 2.3995 4.8046 3.0343 3.0633 7.2849 6.1797 3.2896 5.5373 2.3067 7.0394 4.9517 4.7248 4.6449 5.7394 6.1502 3.7727 1.6824 1.2453 4.1665 1.7184 2.6111 1.3335 2.8416 2.4846 2.4586 1.3421 2.2323 3.4750 2.8105 2.2962 1.2928 2.2781 1.3919 1.4345 1.6976 2.4103 3.4551 1.2331 1.6967 1.4544 2.4845 1.3520 1.3543 2.3158 3.7383 1.3969 2.5230 6.0003 4.7421 1.0788 1.0870 1.1045 1.0987 2.5205 7.9224 6.5865 1.0686 1.0682 1.0650 1.0641 1.0959 1.0952 1.0978 1.0993 1.0893 1.0879 1.0961 1.0967
irintensity: 0.2580 0.9158 0.4078 0.5997 0.0645 10.7750 0.1641 1.5355 4.7813 13.0590 2.0007 1.2732 2.9771 1.2310 0.2707 0.0080 0.1291 4.7094 4.2854 8.5640 10.1909 50.9732 0.6682 1.6326 27.2190 0.8988 3.5995 8.4611 49.4340 5.5692 0.4946 14.8269 69.2754 23.9712 0.7248 3.5000 31.2151 66.4517 0.2221 41.5348 32.3199 79.1082 11.8300 18.2302 255.6622 30.4991 9.2498 156.6791 451.8723 332.8151 0.6827 8.6835 18.9045 338.0577 41.1432 29.1277 43.0770 65.2398 11.7296 244.4236 85.5539 21.8947 11.5698 0.3740 20.6199 5.8352 36.3742 24.0877 170.2233 44.7547 61.1760 43.8824 59.1483 12.0811 15.4589 20.1566 40.3395 3.3792 1.0975 0.6433 1.6747
temp: 298.150 k
press: 1.00000 atm
elementType: 8 8 8 7 7 7 7 6 6 6 6 6 6 6 6 6 6 1 1 1 1 1 1 1 1 1 1 1 1
symmnumber: 1
zpe: 580244.2 jmol-1
zpe.correction: 0.221003 hartree
zpe.thermalcorrener: 0.235768 hartree
zpe.thermalcorrenthalpy: 0.236712 hartree
zpe.thermalcorrgfe: 0.176884 hartree
zpe.sumelectzpe: -831.534786 hartree
zpe.sumelectthermal: -831.520021 hartree
zpe.sumelectthermalent: -831.519077 hartree
zpe.sumelectthermalfe: -831.578905 hartree
dipole: -8.4665 -0.0461 -0.1538
dipole: 8.4681
quadrupole: -139.8253 -89.2939 -98.0074
quadrupole: 5.9408 -1.4300 0.2808
quadrupole: -30.7831 19.7483 11.0348 5.9408 -1.4300 0.2808
hfenergy: -831.755789 hartree
pointgroup: C01 [X(C10H12N4O3)]
dipole: 3.3298161 -0.0056369 0.1085306 debye
polarizability: 361.3505169|-1.21233|140.8951819|14.4706648|-19.3236879|81.8672173 unknown
InChI: InChI=1S/C10H12N4O3/c15-14(16)10-3-1-9(2-4-10)11-12-13-5-7-17-8-6-13/h1-4H,5-8H2
charge 0 multiplicity 1
29 atoms
O  5.631185 -0.016888 -0.245466
O  -5.598183 0.783462 -0.489739
O  -5.330652 -1.396116 0.137608
N  2.861926 -0.103951 0.399569
N  1.534208 -0.369548 0.402398
N  0.776783 0.647596 0.026706
N  -4.859246 -0.225371 -0.153536
C  3.477175 1.20079 0.058195
C  3.754584 -1.162342 0.899513
C  4.703072 0.956278 -0.846983
C  4.957625 -1.311322 -0.056204
C  -0.611963 0.336742 0.007451
C  -1.468955 1.41382 -0.358215
C  -1.181536 -0.936753 0.318598
C  -3.399641 -0.030511 -0.098693
C  -2.860491 1.238807 -0.412799
C  -2.570132 -1.119486 0.266188
H  3.788992 1.706662 0.993462
H  2.709843 1.815832 -0.439987
H  3.173169 -2.09632 0.969976
H  4.122565 -0.889634 1.909002
H  4.37121 0.594049 -1.843291
H  5.285558 1.88337 -0.96785
H  5.716826 -1.983386 0.374485
H  4.619487 -1.710864 -1.036359
H  -1.012667 2.38032 -0.592717
H  -0.521078 -1.762049 0.597734
H  -3.534169 2.053517 -0.689896
H  -3.032799 -2.082305 0.499349
