program: Gaussian 09
title: 000280535
version: EM64L-G09RevD.01
frameworkgroup: C1[X(C21H26FN7O4S)]
method: RPBEPBE
basis: SDD
operation: Freq
keyword: #p
keyword: freq=noraman
keyword: PBEPBE/SDD
title: #p freq=noraman PBEPBE/SDD
converged: YES YES NO NO
title: Mulliken charges:
elementType: S F O O O O N N N N N N N C C C C C C C C C C C C C C C C C C C C C H H H H H H H H H H H H H H H H H H H H H H H H H H
charge: 1.082890 -0.345362 -0.260436 -0.285609 -0.486084 -0.475025 -0.185515 -0.098842 -0.186210 -0.644754 -0.615040 -0.498193 -0.514359 0.185408 -0.398523 -0.418051 -0.693691 -0.668509 0.266982 -0.292750 -0.044154 0.351788 -0.361798 -0.338806 0.480181 -0.434932 -0.334473 0.517904 0.280956 -0.046349 -0.457075 -0.326311 -0.264205 -0.185987 0.201171 0.221249 0.250238 0.233677 0.245248 0.182151 0.232263 0.189495 0.237408 0.234030 0.209733 0.197773 0.340547 0.322849 0.319827 0.315375 0.255896 0.247916 0.219901 0.303021 0.294800 0.278984 0.303576 0.321770 0.288764 0.247274
chargesum: 0.00000
title: Mulliken charges with hydrogens summed into heavy atoms:
elementType: S F O O O O N N N N N N N C C C C C C C C C C C C C C C C C C C C C
charge: 1.082890 -0.345362 -0.260436 -0.285609 -0.486084 -0.475025 -0.185515 -0.098842 -0.186210 0.018642 0.020162 -0.203394 -0.210783 0.185408 0.023897 0.065864 -0.034030 -0.007577 0.266982 0.114756 -0.044154 0.351788 -0.105902 -0.090890 0.480181 -0.215031 -0.031452 0.517904 0.280956 -0.046349 -0.178091 -0.004541 0.024559 0.061287
polarizability: 5.83008231e+02 2.94447012e+01 2.88330058e+02 -1.14596045e+01 -9.77250956e+00 2.05690451e+02
1716.lowfreq: -3.3642 -2.2047 -1.0420 -0.0017 0.0018 0.0025 6.4826 11.0916 15.8059
frequency: 6.3831 10.8958 15.7612 20.2978 24.0806 29.9543 32.2820 48.7101 53.6430 60.2479 67.7454 73.0636 98.0254 106.1331 118.1649 126.5325 134.5142 142.4275 173.1907 177.6182 185.5578 195.6280 205.7432 215.4060 223.0283 227.7980 237.5065 244.3495 256.1298 258.6801 293.6424 311.6149 317.4835 318.9111 337.5338 351.6592 352.3208 357.2236 365.7800 382.4681 405.6519 411.5258 412.7619 432.3635 439.7756 451.2559 463.6131 487.7689 502.2775 513.9075 519.6093 521.6162 525.5704 533.2684 541.6903 544.5636 574.8575 611.8069 613.9374 617.9020 629.7999 655.5459 674.0620 678.1496 695.1001 718.7097 722.5583 734.8437 764.4243 767.6216 775.3772 794.6882 812.0781 815.8338 818.0444 830.8133 841.9154 855.2752 872.9017 880.2967 886.0704 901.4216 927.1829 940.1399 944.5501 968.1821 968.7033 976.0661 985.2645 992.4723 994.9015 996.6673 1006.6891 1007.8367 1039.9581 1069.4569 1082.0353 1089.6889 1100.0375 1108.9057 1124.7083 1132.3091 1138.3412 1169.9583 1174.3437 1180.4864 1187.3029 1189.9994 1200.5424 1217.9935 1248.6669 1250.1207 1269.4864 1275.0618 1280.0239 1299.4754 1309.1223 1312.8011 1352.5716 1360.3230 1366.3528 1373.9539 1385.7951 1387.6908 1408.3518 1421.7277 1429.0649 1444.6468 1455.0319 1461.9943 1464.8166 1474.3859 1477.2924 1478.7321 1487.5327 1498.1039 1507.9241 1513.4735 1515.7577 1529.7062 1571.6896 1574.2802 1598.0717 1612.8511 1620.0640 1621.6159 1630.5444 1653.1075 2933.5838 2938.4753 2976.6685 2990.8169 2993.1856 3017.3652 3047.4798 3074.5553 3085.3270 3090.8743 3099.0975 3111.9048 3112.9603 3136.6016 3156.4284 3161.7232 3170.8132 3179.7272 3198.5267 3198.7842 3519.8219 3532.0278 3568.4713 3569.9428 3726.0712 3732.1093
redmass: 8.3048 5.0774 6.0862 7.4287 5.1323 4.7899 5.2317 5.2768 5.4994 7.1168 7.2528 5.4416 5.7118 6.7567 4.9230 3.3475 2.3321 3.3480 4.2996 4.5266 6.6964 2.6897 1.7208 3.6100 3.2925 1.7509 5.2272 1.0895 4.7033 4.4362 2.3916 10.4894 2.7865 8.5910 3.9411 3.7382 3.7573 4.3710 1.1976 2.2303 6.2192 4.1058 3.1034 4.7229 4.4790 4.4940 1.9389 2.4685 2.9612 3.3694 1.9182 1.3562 2.4164 2.3007 4.4069 4.7376 5.2624 4.8491 6.1488 1.2783 7.0447 7.4457 7.6111 2.4124 10.5664 3.6882 10.3930 3.4387 2.1845 1.9321 6.3764 1.2981 1.3122 3.9268 5.5487 1.7149 2.0800 15.4875 1.5595 1.5152 6.2647 1.5348 1.3530 1.3650 1.8170 4.9459 1.3647 5.4344 1.3972 8.7393 3.0069 3.7623 1.3585 3.5858 3.3409 2.1738 3.4479 1.5686 2.3469 1.7207 1.3080 2.0086 1.7916 5.0593 1.8454 1.1657 1.5446 2.9237 1.6479 2.4324 2.7772 2.0866 1.6897 1.2728 1.1537 1.1883 1.4007 1.8074 1.3665 3.4118 1.2320 3.7368 1.2505 1.6277 3.9937 4.1175 3.9856 1.1163 1.4678 1.2402 1.0673 1.1575 1.5455 1.5161 1.2385 2.0220 2.2473 1.4999 1.9800 2.9910 4.5472 1.5890 5.2907 1.9358 6.3961 2.4410 6.4286 3.8413 1.0635 1.0630 1.0364 1.0370 1.1057 1.0619 1.0877 1.0978 1.1034 1.0984 1.1004 1.0996 1.0902 1.0923 1.0888 1.0895 1.0946 1.0959 1.0952 1.0950 1.0768 1.0758 1.0446 1.0445 1.1038 1.1058
irintensity: 0.8462 0.1257 1.0415 0.3168 0.3185 0.4981 0.6898 2.2333 1.0488 1.7880 14.8279 0.2606 3.0249 0.1769 3.1237 3.4293 0.7684 6.2435 2.9014 5.1246 1.6262 7.3020 2.0875 26.8341 1.1377 83.5932 7.7854 1.1714 19.5914 6.8717 19.2525 11.8964 7.2193 9.2613 4.2697 2.2940 2.3729 21.3565 261.8560 6.6083 4.3223 10.1709 0.2396 30.9725 59.5202 1.6457 6.6860 45.4738 15.8163 11.9960 5.0397 97.1202 41.5765 8.5547 63.0808 54.5765 20.9641 3.3034 10.1904 145.3659 8.9584 19.6977 1.4734 31.1775 21.8814 0.0776 38.1720 2.3051 6.5389 10.5441 18.0240 48.6120 11.9976 25.0284 14.8374 77.9024 10.9399 102.9971 47.3976 12.7886 8.7374 0.7746 3.2167 0.4582 4.7058 20.2005 2.9010 88.0163 7.2064 89.7405 15.8009 5.1497 3.8704 16.9614 18.7071 11.1051 6.6186 16.2422 0.4166 2.8009 14.3098 31.4469 6.0644 190.6379 340.2171 81.9788 42.2917 48.3749 15.4581 514.0952 38.7838 60.0857 9.9121 3.3120 6.2507 25.5745 87.6032 77.6083 40.6658 73.7674 27.7810 269.1105 14.6146 20.9401 330.3736 35.8221 33.3684 14.4308 38.3138 19.6370 2.2253 216.9063 184.5808 103.8562 68.0411 691.1681 336.4347 234.5216 280.3099 253.6986 110.8328 115.6841 21.6668 518.0822 126.4112 529.0615 13.7475 159.2590 22.4600 65.5905 23.1039 34.1194 32.6287 9.2906 10.7062 29.1505 27.1582 50.1090 16.3012 28.6924 21.7154 12.3290 7.7967 15.4769 4.6778 11.7203 20.8916 0.3534 7.6449 23.2518 65.8747 73.3008 41.2871 37.0022
temp: 298.150 k
press: 1.00000 atm
elementType: 16 9 8 8 8 8 7 7 7 7 7 7 7 6 6 6 6 6 6 6 6 6 6 6 6 6 6 6 6 6 6 6 6 6 1 1 1 1 1 1 1 1 1 1 1 1 1 1 1 1 1 1 1 1 1 1 1 1 1 1
symmnumber: 1
zpe: 1211635.7 jmol-1
zpe.correction: 0.461488 hartree
zpe.thermalcorrener: 0.496559 hartree
zpe.thermalcorrenthalpy: 0.497503 hartree
zpe.thermalcorrgfe: 0.388286 hartree
zpe.sumelectzpe: -1995.236499 hartree
zpe.sumelectthermal: -1995.201428 hartree
zpe.sumelectthermalent: -1995.200483 hartree
zpe.sumelectthermalfe: -1995.309700 hartree
dipole: -4.2919 0.0689 -2.4129
dipole: 4.9242
quadrupole: -343.6542 -194.8620 -211.0360
quadrupole: 11.0907 4.0845 -2.7993
quadrupole: -93.8035 54.9888 38.8147 11.0907 4.0845 -2.7993
hfenergy: -1995.6979863 hartree
pointgroup: C01 [X(C21H26F1N7O4S1)]
dipole: -1.6697846 -0.5220726 0.8321697 debye
polarizability: 583.4220168|-27.1839945|275.1005391|-11.1034104|31.6068944|218.5061839 unknown
InChI: InChI=1S/C21H26FN7O4S/c1-21(2)28-18(23)27-19(24)29(21)11-4-12-33-16-9-7-14(8-10-16)25-20(30)26-15-5-3-6-17(13-15)34(22,31)32/h3,5-10,13,25-26H,4,11-12,23-24H2,1-2H3
charge 0 multiplicity 1
60 atoms
S  10.423624 0.522252 -0.032838
F  10.642022 1.164078 -1.763187
O  -2.695419 1.112919 0.373607
O  3.548745 -1.149847 -0.372683
O  10.213419 1.825183 0.886292
O  11.626304 -0.514003 0.205431
N  -7.350155 -0.512399 0.073745
N  -9.515065 0.122575 -1.00311
N  -9.287424 -0.054075 1.436403
N  -7.277903 -0.570249 2.461759
N  -11.242333 0.740388 0.452406
N  2.967901 1.054262 0.225127
N  5.21905 0.474448 0.018268
C  -8.208798 -0.518146 -1.207719
C  -5.922358 -0.869132 -0.01076
C  -4.967545 0.335383 0.194539
C  -7.484735 0.277237 -2.32091
C  -8.431062 -1.998281 -1.63236
C  -7.995452 -0.378907 1.291076
C  -3.499484 -0.08654 0.088895
C  -9.967359 0.244204 0.237332
C  -1.296821 0.992094 0.313574
C  -0.572079 2.177311 0.592074
C  -0.596706 -0.197988 0.001902
C  1.540822 0.974031 0.241121
C  0.830613 2.165825 0.555721
C  0.815148 -0.210299 -0.035507
C  6.384651 -0.2861 -0.227092
C  3.87386 0.033816 -0.066834
C  8.798976 -0.368345 -0.293737
C  7.634624 0.369546 -0.052926
C  6.369518 -1.65165 -0.637021
C  8.836246 -1.711137 -0.696634
C  7.579685 -2.339494 -0.860214
H  -5.682975 -1.677891 0.714502
H  -5.742565 -1.311332 -1.006077
H  -5.182739 1.104457 -0.567361
H  -5.139667 0.804722 1.18046
H  -8.150731 0.302462 -3.198942
H  -6.523805 -0.175303 -2.626773
H  -7.318636 1.316851 -1.99217
H  -7.479535 -2.519323 -1.852632
H  -9.059437 -2.020503 -2.539121
H  -8.961852 -2.54175 -0.831161
H  -3.263383 -0.463608 -0.928759
H  -3.252223 -0.882919 0.824414
H  -7.800255 -0.426604 3.322491
H  -6.305431 -0.853147 2.496107
H  -11.550558 0.897219 1.406782
H  -11.819413 0.988182 -0.345456
H  -1.124425 3.090666 0.830813
H  -1.130294 -1.127304 -0.217076
H  1.377617 3.092864 0.772285
H  1.354792 -1.126655 -0.278689
H  3.33909 1.980517 0.44756
H  7.700004 1.414809 0.271413
H  5.387045 1.445485 0.290264
H  5.407596 -2.149852 -0.766188
H  9.780602 -2.236059 -0.863097
H  7.544574 -3.388142 -1.17193
