program: Gaussian 09
title: 000280618
version: EM64L-G09RevD.01
frameworkgroup: C1[X(C28H25NO2S)]
method: RPBEPBE
basis: SDD
operation: Freq
keyword: #p
keyword: freq=noraman
keyword: PBEPBE/SDD
title: #p freq=noraman PBEPBE/SDD
converged: YES YES NO NO
title: Mulliken charges:
elementType: S O O N C C C C C C C C C C C C C C C C C C C C C C C C C C C C H H H H H H H H H H H H H H H H H H H H H H H H H
charge: 0.167980 -0.400988 -0.247493 -0.584959 -0.589857 0.494259 0.370909 0.444093 -0.655485 -0.388583 -0.382801 -0.373073 -0.398546 -0.339560 -0.326530 -0.181797 0.361825 -0.423194 -0.424257 -0.256167 -0.249731 -0.250298 -0.247544 0.335871 -0.248946 -0.245383 0.231347 -0.396349 -0.397022 -0.236785 -0.237688 -0.242390 0.247382 0.290580 0.260322 0.239029 0.258721 0.261029 0.282132 0.255756 0.259629 0.238794 0.235999 0.225285 0.226164 0.239667 0.225773 0.228561 0.228026 0.294450 0.288535 0.239249 0.237595 0.225656 0.225065 0.229675 0.376069
chargesum: 0.00000
title: Mulliken charges with hydrogens summed into heavy atoms:
elementType: S O O N C C C C C C C C C C C C C C C C C C C C C C C C C C C C
charge: 0.167980 -0.024919 -0.247493 -0.001975 -0.589857 0.494259 0.370909 0.444093 -0.117523 -0.128261 -0.143772 -0.114352 -0.137516 -0.057428 -0.070774 0.077833 0.361825 -0.184400 -0.188258 -0.030882 -0.023567 -0.010631 -0.021772 0.335871 -0.020385 -0.017357 0.231347 -0.157099 -0.159427 -0.011130 -0.012623 -0.012715
polarizability: 4.36315678e+02 1.81889267e+01 3.38656101e+02 1.65107447e+01 -1.14763058e+01 2.67196752e+02
1716.lowfreq: -10.6200 -0.0006 0.0010 0.0011 0.0525 5.6407 10.5453 21.7469 23.2514
frequency: 6.3877 21.7357 23.2134 30.5585 33.7919 42.4802 50.2172 56.5030 56.9530 72.8619 85.1955 89.0531 92.1185 103.2596 139.0356 168.1777 184.6950 198.1057 209.4980 220.2982 241.9244 250.5941 255.8933 275.3540 286.3489 298.0927 316.3833 335.2392 373.5269 388.4272 401.3897 403.9088 407.3138 410.4667 421.5872 449.8193 487.6013 495.7622 504.0026 514.1031 557.6039 588.6450 612.9344 613.5822 615.3355 619.5086 620.1037 622.4534 635.2678 656.9035 684.8970 701.5593 702.6814 705.8004 717.8650 725.9532 741.4676 748.4397 754.5395 768.5142 772.9407 813.5815 833.5692 846.6369 849.9256 854.7453 861.0412 884.5002 901.5952 913.5832 920.7126 934.3315 938.5816 960.0941 973.8107 976.3826 981.9148 986.2645 988.6419 990.0495 990.3193 993.7060 995.7396 996.4305 1000.7540 1015.8259 1018.7115 1028.8430 1031.8570 1041.3977 1066.0996 1082.9833 1084.3021 1087.4536 1088.7330 1113.4520 1128.8205 1147.0289 1173.2029 1173.2613 1173.3387 1177.7984 1191.8897 1195.8011 1197.6659 1198.5009 1207.4665 1216.2685 1246.0655 1262.1525 1291.7637 1305.1181 1313.1794 1317.1395 1325.6506 1332.6395 1348.8206 1373.1119 1374.1542 1378.4192 1396.1075 1408.7375 1429.5559 1433.3505 1436.2290 1436.8356 1475.0748 1478.3981 1479.9311 1512.0728 1559.7642 1583.4628 1587.4562 1588.6737 1605.8418 1608.5349 1612.3209 1612.6532 1617.4354 1666.7578 3011.6944 3065.2683 3096.9915 3122.1880 3122.4341 3125.3762 3125.6002 3128.9020 3130.2968 3133.2572 3138.0498 3140.3392 3142.9970 3148.3982 3148.7402 3151.5299 3155.5776 3160.6105 3164.7990 3166.4706 3169.2889 3170.2719 3494.6639 3499.8901 3637.1972
redmass: 4.1718 6.2695 5.8838 5.1937 4.1536 5.4503 5.0077 5.5231 4.5029 4.0421 5.3531 4.6969 5.3438 5.1730 4.2355 7.5563 4.2296 1.7596 3.8514 4.6978 4.9282 3.9524 4.0488 2.1721 5.0480 4.9702 5.4758 4.7999 5.9881 6.7501 2.8489 2.8584 2.9000 2.9941 4.5651 2.2904 3.5712 1.9991 3.5439 3.5254 2.9397 3.0048 6.4329 6.3145 6.0356 1.8412 2.9979 4.9719 6.2161 5.9945 4.5132 1.7581 2.1203 1.8651 2.8303 3.7685 2.9538 3.1231 3.0531 1.9581 2.0886 3.1164 1.6828 1.3470 1.2570 1.2505 1.2599 4.6109 3.0900 1.5767 1.5159 1.5507 1.5124 1.4456 1.4364 1.4070 1.3887 1.4724 4.7099 6.0974 4.8232 1.3145 6.0775 1.3206 1.3296 5.3372 2.8994 2.3711 2.1599 1.9211 2.3246 1.4229 1.6219 1.6220 1.6216 1.8471 1.4304 3.1662 1.0513 1.0541 1.0527 1.4017 1.1240 1.1322 1.1173 2.4412 1.7453 2.3628 1.3026 1.5165 2.9097 1.3594 1.4633 1.3826 1.3289 1.2399 2.8040 6.8678 6.7193 8.1692 1.7364 3.9443 1.8597 1.3699 1.9808 2.2704 2.1333 2.1580 2.1514 2.7891 6.1636 5.8605 6.2937 6.1982 5.8771 5.8118 1.3790 4.3490 6.3240 4.2558 1.0565 1.0881 1.1061 1.0845 1.0846 1.0854 1.0874 1.0871 1.0881 1.0886 1.0882 1.0917 1.0934 1.0963 1.0931 1.0955 1.0956 1.0951 1.1016 1.0997 1.0997 1.0934 1.0444 1.0637 1.1005
irintensity: 0.1105 0.1541 0.0930 0.2809 0.3114 5.4554 1.7567 1.7869 0.5076 0.6071 1.7335 0.0122 0.8640 0.1755 1.8870 5.4402 4.5442 40.9359 8.3384 3.1879 1.6177 2.5030 1.4191 44.0642 0.7847 0.4742 1.4250 1.4243 3.5571 9.1520 0.3795 0.1958 1.3698 0.0886 1.1568 56.5406 12.9682 275.0445 10.2437 16.1274 2.9103 14.0514 1.4090 0.0918 0.9030 132.8104 69.6902 12.4402 5.1716 17.5067 6.5470 47.0625 25.5864 25.9040 183.7912 8.4542 35.0918 25.4324 6.1400 35.5798 44.3223 3.1382 19.4682 9.5960 0.5933 1.2807 1.2559 8.9356 0.8194 8.0725 2.1330 0.3372 0.1682 2.4489 0.3951 0.6294 0.5005 0.8840 0.5823 0.7150 1.2985 0.0573 14.3550 0.4345 1.5513 143.2093 1.7852 5.4657 19.3903 6.5941 138.0801 46.3083 7.0439 3.5117 2.6706 9.9038 2.9970 1.1699 0.0433 0.2336 0.0361 4.9181 0.3657 6.9231 4.2690 11.1562 5.2918 4.7379 3.9988 7.8212 0.3364 2.3927 4.7249 2.0603 0.8970 4.0748 5.1350 0.0324 0.8241 1.5720 16.1607 5.0214 22.0961 4.0419 10.0705 6.6902 57.8942 19.9362 28.6264 7.0149 4.9463 1.1479 1.3674 0.1637 2.6984 8.1560 93.5002 18.5296 1.3696 119.8124 26.0804 8.4643 6.1700 11.6388 1.4605 0.3924 3.2679 9.1570 4.7958 15.1609 4.6749 10.9251 25.6276 32.0968 28.0795 21.1782 20.5348 18.1862 31.8947 21.9633 16.4960 6.4689 15.0423 22.8719 10.5663
temp: 298.150 k
press: 1.00000 atm
elementType: 16 8 8 7 6 6 6 6 6 6 6 6 6 6 6 6 6 6 6 6 6 6 6 6 6 6 6 6 6 6 6 6 1 1 1 1 1 1 1 1 1 1 1 1 1 1 1 1 1 1 1 1 1 1 1 1 1
symmnumber: 1
zpe: 1182776.1 jmol-1
zpe.correction: 0.450496 hartree
zpe.thermalcorrener: 0.479856 hartree
zpe.thermalcorrenthalpy: 0.480800 hartree
zpe.thermalcorrgfe: 0.385628 hartree
zpe.sumelectzpe: -1682.999641 hartree
zpe.sumelectthermal: -1682.970280 hartree
zpe.sumelectthermalent: -1682.969336 hartree
zpe.sumelectthermalfe: -1683.064508 hartree
dipole: -1.4315 -0.8561 0.7204
dipole: 1.8169
quadrupole: -187.0155 -170.8346 -192.3709
quadrupole: 5.3563 1.6791 -1.7429
quadrupole: -3.6085 12.5724 -8.9639 5.3563 1.6791 -1.7429
hfenergy: -1683.4501363 hartree
pointgroup: C01 [X(C28H25N1O2S1)]
dipole: 0.5778842 -0.1058869 -0.4071681 debye
polarizability: 440.7154828|0.2829998|317.1890891|-2.9021911|33.627856|284.263959 unknown
InChI: InChI=1S/C28H25NO2S/c29-26(27(30)31)20-32-28(23-12-6-2-7-13-23,24-14-8-3-9-15-24)25-18-16-22(17-19-25)21-10-4-1-5-11-21/h1-19,26,30H,20,29H2
charge 0 multiplicity 1
57 atoms
S  -1.679137 -1.204694 1.328212
O  -4.799156 -2.95094 2.065989
O  -4.962352 -2.328742 -0.165645
N  -3.217057 -4.731118 -0.326401
C  -0.965833 0.32833 0.279258
C  0.574952 0.264788 0.22128
C  -1.607939 0.303076 -1.11695
C  -1.403629 1.533812 1.142919
C  -1.895402 -2.62142 0.080432
C  1.310776 1.466902 0.040302
C  1.305198 -0.94686 0.2727
C  -0.82791 0.341176 -2.301175
C  -2.142798 2.624157 0.622206
C  -3.02345 0.240974 -1.246678
C  -0.992784 1.583945 2.503643
C  -2.983722 -3.608038 0.59234
C  3.448753 0.238911 -0.028186
C  2.713904 1.454611 -0.081289
C  2.709956 -0.960955 0.153249
C  -1.443159 0.326848 -3.575461
C  -2.480236 3.725804 1.443382
C  -3.637347 0.219492 -2.514744
C  -1.336231 2.676315 3.325086
C  4.934676 0.223545 -0.14946
C  -2.849095 0.267729 -3.689745
C  -2.085242 3.755772 2.798302
C  -4.325473 -2.884072 0.757596
C  5.721888 1.301256 0.343466
C  5.607466 -0.870425 -0.761825
C  7.128167 1.287054 0.227382
C  7.013684 -0.887469 -0.876847
C  7.782731 0.192054 -0.383233
H  -0.945306 -3.167716 -0.050493
H  -2.212798 -2.185987 -0.88192
H  0.777598 2.422437 -0.006598
H  0.774248 -1.886007 0.450584
H  0.26304 0.385068 -2.234746
H  -2.453806 2.621794 -0.426514
H  -3.641729 0.171666 -0.345608
H  -0.398311 0.759922 2.91497
H  -2.694671 -4.013445 1.576078
H  3.242403 2.400255 -0.246826
H  3.242699 -1.914712 0.240768
H  -0.818741 0.358708 -4.475619
H  -3.050561 4.55995 1.018962
H  -4.728116 0.148689 -2.581303
H  -1.016677 2.689097 4.37322
H  -3.324599 0.249047 -4.676885
H  -2.35055 4.607963 3.43407
H  -3.534721 -4.467784 -1.262249
H  -2.531278 -5.486072 -0.299175
H  5.231649 2.141135 0.848714
H  5.02316 -1.699412 -1.177334
H  7.713844 2.124878 0.622301
H  7.508852 -1.737536 -1.359755
H  8.874627 0.179993 -0.472552
H  -5.675456 -2.48015 2.126804
