program: Gaussian 09
title: 000025211
version: EM64L-G09RevD.01
frameworkgroup: C1[X(C14H22)]
method: RPBEPBE
basis: SDD
operation: Freq
keyword: #p
keyword: freq=noraman
keyword: PBEPBE/SDD
title: #p freq=noraman PBEPBE/SDD
converged: YES YES NO NO
title: Mulliken charges:
elementType: C C C C C C C C C C C C C C H H H H H H H H H H H H H H H H H H H H H H
charge: 0.446634 0.446632 -0.249861 -0.249856 0.254746 0.254747 -0.632160 -0.632156 -0.697989 -0.697990 -0.697993 -0.697989 -0.860165 -0.860163 0.225366 0.225365 0.227917 0.227918 0.212595 0.209485 0.224518 0.224518 0.209485 0.212594 0.224519 0.209486 0.212592 0.212597 0.209486 0.224517 0.230829 0.229734 0.229738 0.229738 0.229735 0.230829
chargesum: 0.00000
title: Mulliken charges with hydrogens summed into heavy atoms:
elementType: C C C C C C C C C C C C C C
charge: 0.446634 0.446632 -0.024496 -0.024491 0.254746 0.254747 -0.404242 -0.404238 -0.051391 -0.051392 -0.051396 -0.051389 -0.169863 -0.169862
polarizability: 1.94436748e+02 2.17232725e+00 1.54491739e+02 1.86445855e-03 2.38171648e-04 1.09376570e+02
1716.lowfreq: -10.2927 -0.0004 0.0003 0.0005 11.3819 12.5118 19.6848 22.8966 66.6788
frequency: 19.6848 21.8867 66.6788 127.7574 141.2911 159.7460 174.1880 175.1273 197.0404 211.4714 213.1820 238.4405 239.3788 244.2504 271.1933 289.6915 299.7579 350.8411 400.2701 458.1103 466.2109 466.6836 472.3360 493.9267 582.0817 622.3147 662.6394 720.6924 762.2548 781.3781 869.9658 889.6746 893.7217 894.3607 913.8468 913.8510 953.4061 953.5877 986.2531 994.8035 1027.5624 1039.5532 1043.2549 1080.1756 1103.4175 1113.5268 1114.2224 1121.3380 1167.3797 1188.0812 1217.9340 1276.9249 1284.9318 1315.5703 1315.9111 1319.4396 1344.7914 1373.8390 1373.8823 1376.7607 1391.8719 1392.8143 1397.0487 1398.5768 1405.8182 1465.1481 1465.3185 1467.7400 1468.0695 1473.4929 1474.8814 1475.3860 1478.0779 1478.3838 1481.3575 1484.6478 1486.1136 1505.8162 1572.5907 1624.8661 2969.0554 2969.5582 2971.5016 2971.5543 2974.5130 2974.9130 3011.5825 3011.7121 3044.9392 3044.9731 3064.2977 3064.3434 3071.2273 3071.6110 3073.6811 3073.7698 3074.4237 3074.5726 3080.4310 3080.4686 3104.5410 3108.3367
redmass: 2.6622 2.7015 2.8878 2.7470 2.7427 2.9076 1.0356 1.0305 2.5876 1.0627 1.0849 1.1217 1.0807 2.6301 2.5286 2.9910 3.3105 2.3813 2.4179 4.1313 4.1362 2.6009 2.6790 3.2234 2.7722 3.1669 4.1052 4.8613 2.7865 2.9858 2.7543 2.4261 1.4367 1.4456 1.1868 1.1868 1.4396 1.4413 1.4838 1.9571 1.5450 1.5608 1.5315 1.5099 1.9475 2.6568 2.6488 2.5305 2.0973 2.5049 1.5625 1.2579 5.5142 1.2929 1.2933 2.4607 1.4046 1.1954 1.1953 3.1112 1.4248 1.2033 1.4216 1.2082 1.8521 1.0450 1.0450 1.0516 1.0515 1.0817 1.0467 1.0463 1.0919 1.0465 1.2176 1.0639 1.0604 2.3690 6.5953 6.3794 1.0373 1.0373 1.0347 1.0347 1.0351 1.0351 1.0836 1.0837 1.0975 1.0975 1.1000 1.1000 1.0993 1.0992 1.1003 1.1003 1.0982 1.0984 1.0987 1.0986 1.0895 1.0902
irintensity: 0.0274 0.0000 0.2253 2.7042 0.0000 0.4235 0.0000 0.2192 0.0000 0.0069 0.0000 0.0000 0.2096 0.0000 0.2028 0.0000 0.5210 0.8481 0.0000 0.0000 0.0000 10.6092 0.7284 0.0000 0.0000 1.1845 1.0436 0.0000 0.0000 5.6247 0.0000 4.0567 19.2501 0.0000 1.8176 1.6349 0.1117 0.0000 26.3339 0.0000 0.0000 0.0000 10.8550 33.6655 0.0000 0.0001 5.2685 16.0606 0.0000 0.4653 8.9393 0.0000 0.0000 2.2111 0.0001 11.6746 0.0000 0.0959 31.5669 10.4126 21.9666 0.0000 8.0909 0.0000 12.3789 0.0001 5.4292 4.1600 0.0000 0.0000 0.0000 28.8377 17.3020 0.0002 34.8132 17.2785 0.0000 54.1579 0.0000 0.0000 74.8843 0.0014 0.0257 68.5704 84.6551 0.0005 19.3620 0.0361 0.7921 40.4258 0.0034 2.0034 168.3794 0.0032 0.0504 46.3686 95.8815 0.0144 0.6219 84.0629 62.9738 0.0000
temp: 298.150 k
press: 1.00000 atm
elementType: 6 6 6 6 6 6 6 6 6 6 6 6 6 6 1 1 1 1 1 1 1 1 1 1 1 1 1 1 1 1 1 1 1 1 1 1
symmnumber: 1
zpe: 837783.7 jmol-1
zpe.correction: 0.319095 hartree
zpe.thermalcorrener: 0.335747 hartree
zpe.thermalcorrenthalpy: 0.336691 hartree
zpe.thermalcorrgfe: 0.274725 hartree
zpe.sumelectzpe: -545.611502 hartree
zpe.sumelectthermal: -545.594849 hartree
zpe.sumelectthermalent: -545.593905 hartree
zpe.sumelectthermalfe: -545.655872 hartree
dipole: 0.0000 0.0000 0.0000
dipole: 0.0000
quadrupole: -82.6139 -83.2083 -91.1829
quadrupole: 1.5511 0.0002 -0.0001
quadrupole: 3.0545 2.4601 -5.5146 1.5511 0.0002 -0.0001
hfenergy: -545.9305967 hartree
pointgroup: C01 [X(C14H22)]
dipole: 0.0000028 -0.0000024 0.0000131 debye
polarizability: 194.4745964|1.7904514|154.4538906|0.0018666|0.0002204|109.3765703 unknown
InChI: InChI=1S/C14H22/c1-9(2)13-7-12(6)14(10(3)4)8-11(13)5/h7-10H,1-6H3
charge 0 multiplicity 1
36 atoms
C  -1.43556 -0.085279 -0.000035
C  1.435547 0.085351 -0.000022
C  -2.969553 -0.113149 -0.000059
C  2.969547 0.11321 0.000031
C  -0.65223 -1.277606 -0.000011
C  0.652219 1.277681 -0.000039
C  -0.758537 1.15886 -0.000046
C  0.758528 -1.158785 -0.000007
C  -3.555305 0.548555 -1.277668
C  -3.555351 0.548612 1.277495
C  3.555369 -0.548703 -1.277428
C  3.555234 -0.54836 1.277734
C  -1.283457 -2.66345 0.000007
C  1.28345 2.663524 -0.000038
H  -3.298543 -1.169178 -0.000045
H  3.298551 1.169236 -0.000094
H  -1.353122 2.081907 -0.000065
H  1.353112 -2.081832 0.000018
H  -3.287994 1.620355 -1.327983
H  -4.659278 0.474295 -1.283745
H  -3.168699 0.062753 -2.191961
H  -3.168762 0.06287 2.191828
H  -4.659323 0.474334 1.283547
H  -3.288062 1.620421 1.327761
H  3.168796 -0.063069 -2.191825
H  4.659341 -0.474419 -1.28347
H  3.288097 -1.620521 -1.327574
H  3.287909 -1.620154 1.328154
H  4.659207 -0.474114 1.283864
H  3.168589 -0.06246 2.19196
H  -0.504413 -3.445447 0.000151
H  -1.920752 -2.829078 0.889551
H  -1.920535 -2.829192 -0.889674
H  1.920553 2.829239 0.889628
H  1.920716 2.829172 -0.889599
H  0.504409 3.445525 -0.000141
