program: Gaussian 09
title: 000280454
version: EM64L-G09RevD.01
frameworkgroup: C1[X(C9H7NO3)]
method: RPBEPBE
basis: SDD
operation: Freq
keyword: #pfreq=noraman
keyword: PBEPBE/SDD
title: #p freq=noraman PBEPBE/SDD
converged: NO NO NO NO
title: Mulliken charges:
elementType: O O O N C C C C C C C C C H H H H H H H
charge: -0.288816 -0.253657 -0.167737 0.075902 0.253553 -0.322326 -0.305266 0.385696 -0.365968 -0.362429 0.181704 -0.498102 -0.120253 0.277594 0.278265 0.255591 0.253717 0.233185 0.244725 0.244623
chargesum: 0.00000
title: Mulliken charges with hydrogens summed into heavy atoms:
elementType: O O O N C C C C C C C C C
charge: -0.288816 -0.253657 -0.167737 0.075902 0.253553 -0.044732 -0.027001 0.385696 -0.110377 -0.108712 0.181704 0.224431 -0.120253
polarizability: 2.28322873e+02 3.20273675e+00 1.00995698e+02 -9.31695607e-03 3.95633492e-02 4.79474322e+01
1716.lowfreq: -43.7714 -21.5676 -8.1547 -6.2714 -0.0004 -0.0004 0.0006 43.0545 58.8686
frequency: -43.7606 43.0276 58.6013 87.1879 114.2385 135.8978 177.3099 275.5858 292.8234 323.3138 382.4169 409.0294 469.4794 479.6548 485.0060 510.0417 526.7467 632.8668 677.3986 716.6831 758.2113 783.7773 846.3294 867.4738 918.1217 987.0149 995.5311 1006.0677 1073.4936 1098.6612 1112.2337 1112.9007 1150.0227 1182.8160 1259.6868 1298.0670 1363.0581 1421.7216 1424.7488 1448.0866 1450.9304 1462.2531 1544.7214 1564.0421 1622.5384 1623.0099 2391.2985 3011.1047 3115.4354 3153.4766 3155.4103 3158.5021 3173.0872 3183.3978
redmass: 10.3159 6.2592 3.5025 1.3591 3.7341 4.5672 5.3348 10.0078 4.4975 6.9387 7.5361 2.9207 5.6912 11.5570 11.1705 3.2091 7.1575 7.2028 4.2091 6.2264 4.4112 6.3080 1.2494 1.6872 8.2402 1.3655 1.3620 3.2614 4.5708 3.9339 1.2643 1.3652 1.4976 1.1322 3.8688 1.2789 5.4203 1.2070 4.0134 2.9993 1.0498 1.0517 6.0090 7.8593 6.7094 9.6615 12.7376 1.0291 1.1048 1.0886 1.1052 1.0896 1.0973 1.0969
irintensity: 0.1095 0.0294 1.2185 1.6837 0.7923 0.5924 7.3376 4.1546 20.7305 0.4318 5.4990 0.0048 0.9523 10.9245 15.4549 12.5345 15.3156 0.6151 29.8403 4.5744 14.1391 9.5705 0.9578 67.7093 5.2983 0.0757 0.0525 31.1301 166.0941 130.7025 0.0540 11.1670 73.5193 30.3570 371.1461 1.2023 5.0246 49.6037 11.3203 9.1777 14.6166 12.4269 13.3274 11.0411 227.6499 154.4500 1815.3682 40.0221 25.3534 1.1757 14.5769 5.1276 6.3359 2.3141
temp: 298.150 k
press: 1.00000 atm
elementType: 8 8 8 7 6 6 6 6 6 6 6 6 6 1 1 1 1 1 1 1
symmnumber: 1
zpe: 373920.0 jmol-1
zpe.correction: 0.142419 hartree
zpe.thermalcorrener: 0.153747 hartree
zpe.thermalcorrenthalpy: 0.154691 hartree
zpe.thermalcorrgfe: 0.103833 hartree
zpe.sumelectzpe: -626.666851 hartree
zpe.sumelectthermal: -626.655523 hartree
zpe.sumelectthermalent: -626.654578 hartree
zpe.sumelectthermalfe: -626.705437 hartree
dipole: 2.4665 -1.6177 -0.0003
dipole: 2.9497
quadrupole: -85.0819 -70.4681 -75.0545
quadrupole: -9.8436 0.0226 -0.0124
quadrupole: -8.2137 6.4001 1.8136 -9.8436 0.0226 -0.0124
hfenergy: -626.8092697 hartree
pointgroup: C01 [X(C9H7N1O3)]
dipole: 0.9622024 -0.648756 0.0045998 debye
dipolederiv: -1.3551223 0.369539 0.0095453 0.8193567 -0.8714086 0.0056288 -0.0165724 0.0210562 -0.2961174 -0.9718824 -0.2673408 0.0325457 -0.1823138 -0.841476 0.0329893 0.0249597 0.0292375 -0.3299811 -2.1769439 -0.0947702 0.058567 -0.0816557 -0.2692344 0.0023397 0.0586734 0.0027496 -0.2704207 -2.6693867 -0.1115635 0.0769145 -0.1292715 -0.302133 0.008883 0.0772738 0.0083077 -0.1989223 -0.9015149 -0.0212917 0.0257497 -0.0114436 -0.0909953 0.0039332 0.0264187 0.0039863 -0.0186757 0.2321663 0.0937774 -0.014401 -0.1289593 0.0508547 -0.0035262 -0.0019411 -0.0097687 -0.0955802 0.2462964 -0.0648062 -0.0070536 0.1244882 0.036153 -0.0101588 -0.0145054 -0.0044421 -0.0974562 1.717298 0.0710067 -0.0517818 0.0781729 0.295957 -0.0105365 -0.0525898 -0.0102466 0.1288375 -0.3968751 -0.1361154 0.0130964 -0.3227795 -0.0223755 0.0026088 0.0230356 -0.0030133 -0.1727201 -0.4534879 0.088721 0.0037372 0.2872302 0.0212188 -0.0183484 -0.0050141 -0.0126965 -0.1718515 2.2256411 -0.0216809 -0.0549504 -0.4964007 1.3389818 -0.042871 -0.0295472 -0.0527781 0.2438167 0.7757732 -0.1650159 -0.004245 -0.1247717 0.2610246 0.0043729 -0.0054564 0.0047512 0.280223 3.5476499 0.1559941 -0.0973458 0.151504 0.3437717 -0.0047733 -0.0978217 -0.0049539 0.3353448 0.0999159 -0.0662367 0.0049212 -0.0399152 0.0203302 0.0077674 0.0035468 0.0085153 0.155115 0.0932603 0.0585599 -0.0008858 0.0694403 0.0203708 0.0046026 -0.001626 0.0048423 0.1560148 0.019468 0.0799772 0.00058 0.0783737 -0.0040643 0.0061084 0.0005134 0.0058005 0.1699183 0.0363359 -0.0726253 0.0075272 -0.076202 -0.0236434 0.0117091 0.0076509 0.0120718 0.1678464 0.0326668 0.0376216 0.0003194 0.1158487 -0.0943676 0.008194 -0.0038936 0.0103018 0.1213891 -0.0527223 0.0304715 -0.0269203 -0.0710869 0.0573691 -0.1007547 -0.0669147 -0.0677898 -0.0429631 -0.0485364 0.0357781 0.0240801 -0.0596149 0.0736663 0.0918316 0.0738099 0.0540689 -0.0638174 unknown
polarizability: 228.2358694|1.400479|100.8071163|-5.2062785|-2.6134681|48.2230179 unknown
InChI: InChI=1S/C9H7NO3/c1-13-9(12)7-2-4-8(5-3-7)10-6-11/h2-5H,1H3
charge 0 multiplicity 1
20 atoms
O  3.241718 -0.941878 -0.029079
O  3.226545 1.382578 -0.140512
O  -5.510133 -0.193062 0.185478
N  -3.086029 -0.073078 0.112792
C  1.117923 0.161031 -0.026051
C  0.334487 1.34325 -0.059957
C  0.475694 -1.10149 0.05419
C  -1.708251 0.004528 0.065752
C  -1.066662 1.272365 -0.015253
C  -0.925836 -1.183809 0.099461
C  2.598765 0.295563 -0.077585
C  4.723628 -0.894256 -0.065724
C  -4.291384 -0.140572 0.148834
H  0.846959 2.308607 -0.121746
H  1.084507 -2.009091 0.080382
H  -1.675925 2.180769 -0.040905
H  -1.428918 -2.153398 0.16266
H  5.035218 -1.946542 -0.018863
H  5.105571 -0.323022 0.795938
H  5.063925 -0.415195 -0.998111
