program: Gaussian 09
title: 000280489
version: EM64L-G09RevD.01
frameworkgroup: C1[X(C26H20N2)]
method: RPBEPBE
basis: SDD
operation: Freq
keyword: #pfreq=noraman
keyword: PBEPBE/SDD
title: #p freq=noraman PBEPBE/SDD
converged: YES YES NO NO
title: Mulliken charges:
elementType: N N C C C C C C C C C C C C C C C C C C C C C C C C C C H H H H H H H H H H H H H H H H H H H H
charge: -0.450128 -0.450112 0.324716 0.324728 -0.702300 -0.702297 0.173100 0.173083 0.270434 0.270430 0.191773 0.191788 -0.599039 -0.599013 0.519606 0.519632 -0.379888 -0.379884 -0.424177 -0.424176 -0.402932 -0.402937 -0.475991 -0.476025 -0.242748 -0.242748 -0.234349 -0.234352 0.245541 0.242615 0.245538 0.242616 0.270611 0.270603 0.235787 0.235785 0.238793 0.238792 0.234876 0.234875 0.220523 0.220524 0.297886 0.297868 0.222983 0.222982 0.222303 0.222303
chargesum: 0.00000
title: Mulliken charges with hydrogens summed into heavy atoms:
elementType: N N C C C C C C C C C C C C C C C C C C C C C C C C C C
charge: -0.152242 -0.152244 0.324716 0.324728 -0.214143 -0.214143 0.173100 0.173083 0.270434 0.270430 0.191773 0.191788 -0.328428 -0.328410 0.519606 0.519632 -0.144101 -0.144098 -0.185384 -0.185384 -0.168056 -0.168062 -0.255468 -0.255500 -0.019765 -0.019766 -0.012046 -0.012049
polarizability: 4.53151020e+02 2.82129076e-02 2.78341299e+02 -3.01965389e+01 -1.79661118e-02 2.43469132e+02
1716.lowfreq: -3.5321 0.0002 0.0005 0.0007 5.2188 9.9400 11.5828 15.3087 27.9424
frequency: 9.5128 15.1742 27.9390 58.9984 59.4649 127.4366 128.3682 137.6833 143.2265 173.5791 196.8528 235.9287 237.1604 237.9058 237.9619 273.0675 325.9567 335.4542 338.1860 386.9527 417.2410 421.4285 423.4183 434.4499 435.0214 467.1182 483.3110 499.5837 506.3911 515.6664 542.8340 544.4179 565.7075 587.8916 598.3502 605.6405 622.7528 636.5267 659.0608 705.0053 707.1915 725.3980 725.5406 738.3058 739.1399 752.9745 754.9125 772.8555 773.4313 815.8287 816.6053 821.9780 822.0681 863.7851 865.1366 874.3510 879.6899 930.4209 930.8487 938.1599 939.8224 940.9441 941.1346 965.9783 966.3808 981.2623 981.2736 992.2479 992.9090 1024.6768 1024.7763 1093.7197 1094.4978 1110.1700 1121.4564 1124.9159 1131.6071 1131.8278 1147.5186 1166.9732 1167.1292 1184.3522 1186.0297 1195.8558 1200.7725 1201.1163 1224.7567 1236.8782 1269.7856 1287.5968 1289.2461 1301.3243 1306.4915 1345.2465 1367.3614 1373.6535 1388.6042 1388.6398 1426.0984 1426.9202 1444.4972 1444.8979 1449.0881 1456.1845 1461.6152 1462.4803 1479.0619 1490.7767 1497.3993 1506.1004 1589.4330 1590.5026 1592.1091 1596.7428 1620.1305 1620.6442 1629.1097 1638.7345 2982.1250 2982.1529 3026.0233 3026.0666 3112.2087 3112.2239 3118.0179 3118.0281 3124.6508 3124.6613 3138.5530 3138.5817 3140.4479 3140.5150 3149.2178 3149.9088 3158.9008 3158.9697 3499.4963 3510.6181
redmass: 6.5388 4.1154 3.9471 5.7372 5.6873 4.6755 4.1229 4.4610 4.9805 5.2013 4.6685 2.1918 2.1275 5.5112 6.5205 1.0985 4.8172 4.8536 5.2168 5.9218 3.9799 2.7027 3.6421 2.8731 2.8679 1.2926 4.4132 3.9424 3.2661 2.4863 6.2074 5.9828 5.5712 2.9990 3.0344 4.4701 6.3465 6.6015 5.7788 3.0158 2.8475 5.2761 5.3203 1.6540 1.6492 5.2485 5.2808 2.0300 2.0659 1.5821 1.5743 4.7682 4.6257 1.3946 1.3802 1.3935 1.4328 1.5510 1.5407 3.1248 2.9512 1.4104 1.4106 1.9089 1.9061 1.3322 1.3328 6.9239 6.8495 2.0987 2.0974 2.1535 2.1261 2.0654 1.7944 1.7008 1.1484 1.1483 1.4266 1.1453 1.1410 1.6353 1.7418 2.1899 1.8451 1.9621 1.7387 1.8041 1.9169 1.6278 1.6703 1.7513 2.2386 2.9314 4.6197 4.3976 4.5612 4.4234 1.1757 1.1509 2.5842 2.4609 2.2556 2.3720 4.6935 3.5413 2.4569 3.3279 1.8856 3.0565 6.8651 6.7276 6.2441 5.3585 7.2836 7.3125 7.5863 7.0582 1.0608 1.0608 1.0993 1.0993 1.0872 1.0872 1.0852 1.0852 1.0895 1.0895 1.0949 1.0949 1.0955 1.0956 1.0916 1.0914 1.1002 1.1002 1.0776 1.0771
irintensity: 0.0084 1.1502 0.0076 0.2508 0.0173 0.0132 0.4355 0.5685 11.1487 0.1186 0.8683 13.8201 9.4054 14.5585 7.2605 92.3289 0.0039 1.4308 4.6299 0.5911 6.8927 11.6543 0.4618 0.0415 0.0126 126.1120 0.1138 1.3121 0.3915 21.7566 0.8989 0.0463 16.1666 1.9642 15.3597 5.1755 2.6389 1.3565 1.8796 0.0114 0.5253 1.7717 1.0949 53.4106 54.8347 0.0430 0.4537 66.6289 53.7701 32.1116 27.4427 2.3974 0.0532 3.8378 0.0046 18.9196 6.2641 2.3589 1.2835 0.0066 20.6585 0.0623 0.0520 16.3168 12.0303 0.3271 0.2471 0.3459 0.0709 4.5165 17.2268 8.8307 11.8631 0.8089 31.8009 12.9391 0.0133 0.0036 13.0994 0.0197 0.3846 0.6231 3.1496 9.0531 13.0441 1.9310 16.0003 5.3814 168.2759 1.1980 16.4869 0.2244 84.9236 13.0821 17.8383 0.5926 5.7011 12.4218 13.3788 22.6131 53.0978 2.2189 48.4975 90.1372 95.8071 49.0702 34.6298 126.5844 0.6467 1.3999 5.0556 2.1895 8.4708 45.7105 70.9678 9.5059 330.7988 68.3202 2.5847 25.6199 8.5858 7.3012 19.3001 24.3770 5.1396 3.4851 4.0181 2.7787 9.8419 2.5464 77.7761 25.1173 14.4058 1.0292 68.1777 22.3084 12.6695 141.4411
temp: 298.150 k
press: 1.00000 atm
elementType: 7 7 6 6 6 6 6 6 6 6 6 6 6 6 6 6 6 6 6 6 6 6 6 6 6 6 6 6 1 1 1 1 1 1 1 1 1 1 1 1 1 1 1 1 1 1 1 1
symmnumber: 1
zpe: 1003248.6 jmol-1
zpe.correction: 0.382117 hartree
zpe.thermalcorrener: 0.403759 hartree
zpe.thermalcorrenthalpy: 0.404703 hartree
zpe.thermalcorrgfe: 0.329226 hartree
zpe.sumelectzpe: -1110.398218 hartree
zpe.sumelectthermal: -1110.376576 hartree
zpe.sumelectthermalent: -1110.375632 hartree
zpe.sumelectthermalfe: -1110.451109 hartree
dipole: 0.0007 1.9494 0.0005
dipole: 1.9494
quadrupole: -169.0756 -150.3374 -146.8498
quadrupole: 0.0078 -5.1543 -0.0048
quadrupole: -13.6547 5.0835 8.5711 0.0078 -5.1543 -0.0048
hfenergy: -1110.7803357 hartree
pointgroup: C01 [X(C26H20N2)]
dipole: -0.0003577 -0.7669539 0.00146 debye
polarizability: 451.7756615|0.071301|278.3412574|34.616801|-0.0390393|244.8445317 unknown
InChI: InChI=1S/C26H20N2/c1-3-7-23-17(5-1)13-19-15-21(9-11-25(19)23)27-28-22-10-12-26-20(16-22)14-18-6-2-4-8-24(18)26/h1-12,15-16,27-28H,13-14H2
charge 0 multiplicity 1
48 atoms
N  -0.469153 -2.899742 -0.504074
N  0.468831 -2.897941 0.514109
C  -2.984426 -0.317459 0.476592
C  2.984907 -0.319979 -0.475918
C  -3.449606 0.753832 1.457659
C  3.450751 0.747219 -1.461132
C  -3.915917 -0.424706 -0.600987
C  3.915908 -0.423047 0.602494
C  -4.749484 1.250917 0.831674
C  4.750449 1.246604 -0.836581
C  -5.006821 0.541737 -0.383416
C  5.007076 0.542304 0.381493
C  -1.835667 -1.119851 0.533394
C  1.836016 -1.122377 -0.529986
C  -1.604899 -2.059001 -0.510892
C  1.604642 -2.05727 0.517974
C  -3.680817 -1.357852 -1.636027
C  3.680177 -1.35195 1.641205
C  -5.636153 2.242417 1.283472
C  5.637529 2.236115 -1.291942
C  -6.160884 0.831379 -1.146329
C  6.160803 0.834825 1.143802
C  -2.531496 -2.171759 -1.589167
C  2.530736 -2.165831 1.597109
C  -6.794418 2.532323 0.516812
C  6.795464 2.528918 -0.525878
C  -7.05132 1.83062 -0.687255
C  7.051641 1.832048 0.681145
H  -2.704111 1.566421 1.563636
H  -3.611475 0.3406 2.472786
H  2.705476 1.559522 -1.570787
H  3.612999 0.329806 -2.474488
H  -1.113351 -1.030024 1.350618
H  1.114038 -1.035775 -1.347857
H  -4.380933 -1.459034 -2.473021
H  4.379891 -1.449832 2.478928
H  -5.441372 2.788501 2.214154
H  5.443305 2.778456 -2.224925
H  -6.368923 0.294859 -2.079286
H  6.368276 0.302076 2.079041
H  -2.344915 -2.902664 -2.386382
H  2.343661 -2.893463 2.397196
H  -0.299771 -3.515902 -1.302142
H  0.298925 -3.510522 1.314827
H  -7.495257 3.303206 0.856525
H  7.4966 3.298307 -0.868357
H  -7.950413 2.065764 -1.268494
H  7.950478 2.069403 1.261881
