program: Gaussian 09
title: 000280442
version: EM64L-G09RevD.01
frameworkgroup: C1[X(C7H4Cl2N2O6S)]
method: RPBEPBE
basis: SDD
operation: Freq
keyword: #p
keyword: freq=noraman
keyword: PBEPBE/SDD
title: #p freq=noraman PBEPBE/SDD
converged: YES YES NO NO
title: Mulliken charges:
elementType: Cl Cl S O O O O O O N N C C C C C C C H H H H
charge: 0.083891 0.110551 0.957584 -0.525601 -0.493959 -0.440037 -0.202275 -0.132841 -0.136021 -0.713839 -0.019272 0.031152 -0.341294 -0.333338 0.424510 0.720521 -0.571226 0.125875 0.353511 0.353384 0.345514 0.403208
chargesum: 0.00000
title: Mulliken charges with hydrogens summed into heavy atoms:
elementType: Cl Cl S O O O O O O N N C C C C C C C
charge: 0.083891 0.110551 0.957584 -0.525601 -0.493959 -0.036829 -0.202275 -0.132841 -0.136021 -0.014941 -0.019272 0.031152 0.012217 -0.333338 0.424510 0.720521 -0.571226 0.125875
polarizability: 2.08972018e+02 7.13201041e+00 1.86376230e+02 -1.80008960e+00 1.57102290e+00 9.63958505e+01
1716.lowfreq: -0.0019 -0.0007 0.0020 1.5078 5.0520 5.8493 23.7949 41.9504 45.2599
frequency: 23.7598 41.8945 45.2405 52.2263 65.1493 99.2519 108.9342 120.4475 139.6159 163.5919 173.8228 197.7940 210.3446 214.8716 239.2419 278.7868 296.1297 300.6389 307.4302 352.3027 366.4413 395.3962 406.0690 448.5219 496.9822 517.1311 546.2739 585.6712 616.8213 619.2677 633.4777 684.4815 725.4654 733.3104 768.5870 791.3344 802.9772 819.0752 863.6216 919.2643 982.6806 1019.7987 1064.2758 1076.3962 1155.5273 1169.4517 1227.3050 1306.6620 1328.9165 1375.7557 1404.7524 1406.8832 1528.4609 1540.2623 1580.5353 1655.1643 3157.5132 3386.2501 3541.2910 3556.6401
redmass: 12.8509 13.5433 9.5835 11.3475 14.5945 5.3784 9.2164 1.6746 11.6165 9.9395 14.9896 14.1215 11.5707 9.0188 6.6017 3.3679 13.3043 7.7484 17.1464 12.6093 7.7056 6.6147 11.6393 3.1511 11.6304 7.5743 2.4987 7.5951 1.8063 6.0479 5.3529 10.2647 10.9576 10.8505 2.1414 5.9497 5.8673 14.2608 11.2536 3.8120 1.4423 5.0031 4.5555 1.6062 2.7034 1.9779 12.0322 2.3972 8.6198 10.6549 14.4515 4.4183 1.1086 8.5904 9.0668 9.8005 1.0912 1.0412 1.0646 1.1018
irintensity: 1.1628 0.6940 2.4623 1.0591 0.4768 5.4938 0.8823 21.5588 0.7635 0.5137 1.6595 1.5504 0.3490 0.5412 5.0254 0.7262 0.9465 2.1406 0.0432 0.6751 7.1590 9.0424 98.8569 150.0185 11.0643 56.3618 38.1247 14.3810 97.2094 35.6697 36.1057 14.7263 1.9255 12.1945 85.4849 4.5435 62.6373 124.2959 25.9773 54.6657 13.6762 295.2107 33.5744 35.9627 43.4421 56.7510 92.0862 92.2046 5.5259 23.3185 157.7985 32.7837 41.1749 22.0836 70.7870 251.7423 34.1882 47.5307 75.6694 35.0009
temp: 298.150 k
press: 1.00000 atm
elementType: 17 17 16 8 8 8 8 8 8 7 7 6 6 6 6 6 6 6 1 1 1 1
symmnumber: 1
zpe: 302871.5 jmol-1
zpe.correction: 0.115358 hartree
zpe.thermalcorrener: 0.134118 hartree
zpe.thermalcorrenthalpy: 0.135063 hartree
zpe.thermalcorrgfe: 0.066040 hartree
zpe.sumelectzpe: -2146.560531 hartree
zpe.sumelectthermal: -2146.541770 hartree
zpe.sumelectthermalent: -2146.540826 hartree
zpe.sumelectthermalfe: -2146.609849 hartree
dipole: -1.6916 2.4141 2.7758
dipole: 4.0490
quadrupole: -128.5312 -124.3924 -127.4231
quadrupole: 12.3191 -14.0417 0.9667
quadrupole: -1.7490 2.3898 -0.6409 12.3191 -14.0417 0.9667
hfenergy: -2146.6758888 hartree
pointgroup: C01 [X(C7H4Cl2N2O6S1)]
dipole: -0.5500326 -1.0130592 -1.0994714 debye
dipolederiv: -0.2941438 0.2929635 -0.0094446 0.2936277 -0.3609809 0.0029863 -0.0222109 0.0152181 0.0436344 -0.5863167 -0.1731622 0.004125 -0.2278107 -0.0607335 0.0004203 0.0146067 0.0028672 0.0463922 2.1972111 0.3365678 0.2121115 0.2415472 1.2132819 -0.0317796 0.1656206 -0.0306824 1.5178678 -0.6903306 -0.0941181 -0.0527899 -0.0848345 -0.6418226 0.0753048 -0.0264256 -0.0793684 -0.4743349 -0.7472032 -0.0610311 0.0520135 -0.0138911 -0.4350831 -0.1329162 0.0574471 0.0175314 -0.5923708 -0.3583206 -0.269602 -0.0059832 -0.1385796 -1.2763439 -0.0199212 0.0016344 -0.0322325 -0.4137236 -0.9679236 0.1057344 -0.019626 0.2581407 -0.6391706 -0.0015342 -0.0091998 -0.0100339 -0.2907171 -0.1853597 -0.1034578 -0.0569583 -0.1495395 -0.5531557 -0.1703265 -0.0230141 -0.0125429 -0.6348675 -0.1841556 -0.1025029 0.0394234 -0.1432057 -0.5530905 0.1652964 0.0117042 0.0168481 -0.6432313 -0.7734093 -0.0572035 -0.111999 -0.0196129 -0.3890011 0.142269 -0.2151752 0.1043384 -0.7901412 0.1569719 0.2394811 0.0188513 0.3632178 1.080532 0.0051307 0.013751 -0.0021231 1.2354585 -0.2110003 0.0803672 0.0273433 -0.0466572 -0.5159908 -0.009901 0.0949894 0.0102967 -0.1398402 -0.0027579 -0.173705 -0.0018374 -0.2237834 -0.1095684 -0.002346 -0.0038922 0.0022103 -0.047511 0.4975393 -0.5005499 0.0002974 -0.1553768 0.6931122 -0.0154839 0.0165555 -0.0127133 -0.0299114 -0.4708624 0.202918 0.0016655 0.2038424 -0.4827019 0.0007743 -0.007261 -0.0052231 0.086326 -0.5018365 0.1246451 0.0017534 0.0513684 -0.0475564 -0.0021177 -0.0058947 -0.0004823 0.0266321 1.0486623 0.2729234 -0.0157473 0.0450268 0.3349422 -0.0011305 -0.0152887 -0.0000178 -0.0743118 1.3195517 -0.2390618 0.0322987 -0.3468094 1.8437331 0.0244183 0.0140044 0.0368997 0.2371198 0.2064801 -0.0320454 0.006665 0.0045102 0.1817976 0.0024925 0.0075335 0.0007706 0.1543026 0.1918586 -0.0074412 -0.1061934 0.0291968 0.1187407 0.0532728 -0.0307099 0.0174149 0.2570245 0.2124829 0.0557087 -0.0114727 0.0385038 0.2170985 -0.0846406 -0.0317728 -0.0451049 0.1211865 0.1428621 0.1025718 -0.0044963 0.021119 0.3819611 -0.0002682 -0.007002 0.0061292 0.4050164 unknown
polarizability: 210.2469584|-4.4811164|185.063736|2.209693|2.1229535|96.4334043 unknown
InChI: InChI=1S/C7H4Cl2N2O6S/c8-4-2(7(12)13)1-3(18(10,16)17)5(9)6(4)11(14)15/h1,12H,10H2
charge 0 multiplicity 1
22 atoms
Cl -1.905115 2.285363 -0.036846
Cl 3.366323 0.725962 -0.086664
S  -2.912218 -0.975362 0.044798
O  -2.84097 -2.596549 -0.056794
O  -3.684769 -0.212139 1.245605
O  1.52796 -3.514916 -0.101689
O  3.457507 -2.228733 -0.033744
O  1.285763 3.231284 1.070269
O  1.243284 3.213078 -1.219964
N  -3.533857 -0.378695 -1.560122
N  1.10155 2.667769 -0.067136
C  -1.091308 -0.406261 -0.018075
C  -0.147788 -1.435152 -0.035917
C  -0.710058 0.944222 -0.027419
C  1.242226 -1.148513 -0.05251
C  0.668092 1.236591 -0.048234
C  1.645369 0.214679 -0.058613
C  2.211293 -2.292004 -0.060716
H  -0.485801 -2.476633 -0.032763
H  -3.894123 -1.182741 -2.098166
H  -4.215427 0.381246 -1.412095
H  2.187269 -4.259196 -0.098204
