program: Gaussian 09
title: 000025198
version: EM64L-G09RevD.01
frameworkgroup: C1[X(C5H3BrN4O2)]
method: RPBEPBE
basis: SDD
operation: Freq
keyword: #p
keyword: freq=noraman
keyword: PBEPBE/SDD
title: #p freq=noraman PBEPBE/SDD
converged: NO NO NO NO
title: Mulliken charges:
elementType: Br O O N N N N C C C C C H H H
charge: 0.105389 -0.240527 -0.234995 -0.338193 -0.355983 -0.404666 0.005069 0.145810 0.093920 0.142376 0.156317 -0.168886 0.360185 0.363697 0.370487
chargesum: 0.00000
title: Mulliken charges with hydrogens summed into heavy atoms:
elementType: Br O O N N N N C C C C C
charge: 0.105389 -0.240527 -0.234995 0.021992 0.007714 -0.034179 0.005069 0.145810 0.093920 0.142376 0.156317 -0.168886
polarizability: 1.69687323e+02 2.04998768e+00 1.02621920e+02 -1.56555690e-02 5.74460409e-03 3.75738096e+01
1716.lowfreq: -6.3519 -4.8351 -0.0006 -0.0003 0.0001 17.5883 76.4295 140.0399 148.1956
frequency: 76.4179 140.0379 148.1931 173.0363 227.6789 252.2002 338.5645 341.1884 376.4225 483.6678 508.2645 607.7012 623.0033 624.7435 644.5811 659.3896 667.8873 701.1458 737.7433 767.6582 831.4030 930.2746 958.1683 1101.9171 1144.5756 1205.6965 1255.8402 1294.4275 1342.1050 1363.4214 1377.5118 1419.9022 1525.8756 1574.4154 1663.1791 1677.6871 3524.3605 3567.3160 3583.5328
redmass: 12.4546 13.7475 7.6923 8.8519 8.1995 22.5326 9.4201 7.8397 10.8412 9.5714 8.4885 2.9923 12.3347 1.4749 2.7265 5.2988 1.3396 3.6173 3.7166 2.8888 6.4466 8.2332 3.7348 6.2349 2.1200 9.1118 5.1671 2.8577 6.1190 1.9046 2.6067 2.7762 4.8713 10.5839 8.3499 5.8311 1.0770 1.0786 1.0828
irintensity: 0.2023 2.7862 1.2737 5.2752 1.7238 0.0597 24.8372 4.8770 7.0134 20.0021 15.3444 3.6128 0.8962 58.3789 75.9864 5.7244 76.8773 2.1762 52.3254 139.6870 2.9690 8.7507 15.3083 46.7148 13.0557 63.5109 10.9161 67.1127 53.8921 79.6185 390.2449 5.5810 22.0102 28.7398 540.4561 786.0615 79.5760 100.7667 103.7187
temp: 298.150 k
press: 1.00000 atm
elementType: 35 8 8 7 7 7 7 6 6 6 6 6 1 1 1
symmnumber: 1
zpe: 241891.7 jmol-1
zpe.correction: 0.092132 hartree
zpe.thermalcorrener: 0.101628 hartree
zpe.thermalcorrenthalpy: 0.102572 hartree
zpe.thermalcorrgfe: 0.055806 hartree
zpe.sumelectzpe: -574.435948 hartree
zpe.sumelectthermal: -574.426452 hartree
zpe.sumelectthermalent: -574.425507 hartree
zpe.sumelectthermalfe: -574.472273 hartree
dipole: 3.1818 0.6445 0.0000
dipole: 3.2464
quadrupole: -86.2783 -84.0331 -77.5220
quadrupole: 2.8301 -0.0007 -0.0001
quadrupole: -3.6671 -1.4219 5.0891 2.8301 -0.0007 -0.0001
hfenergy: -574.5280794 hartree
pointgroup: C01 [X(C5H3Br1N4O2)]
dipole: 1.2609295 -0.2033687 0.0000039 debye
dipolederiv: -0.6455958 -0.0538638 -0.0001424 0.0370821 0.0115514 -0.0000018 -0.0001405 0.0000119 0.0647037 -0.5862925 -0.0798468 -0.000014 -0.2035634 -1.3312391 -0.0000626 0.0000538 0.0001561 -0.3628284 -1.3856232 0.4047443 0.0000781 0.4737566 -0.6973685 -0.0000403 -0.0000418 -0.0000106 -0.3821403 -0.4521401 0.1805104 0.000054 0.0697809 -0.5500049 -0.0000807 -0.0000331 -0.0000894 -0.1715206 -1.2952531 0.3780843 0.0000202 -0.2169071 -0.4788292 -0.0000151 -0.0000042 -0.000099 -0.3128285 -0.8201041 0.4007467 -0.0000404 0.5630709 -1.0604608 -0.0000081 0.0000782 -0.000096 -0.3674409 -1.0940779 0.2135354 -0.0000488 0.261396 -0.417242 0.0000416 -0.0000938 -0.0000594 -0.2010395 -0.4756299 -0.6437842 -0.0001426 -0.5212148 -0.5383591 -0.0000867 0.0000022 -0.0001408 -0.0191077 1.0330117 -0.4182624 -0.0000633 -0.1149521 0.5925126 0.0001117 0.0000087 0.0002096 0.1178205 1.5108273 0.0981024 0.0000416 0.225546 1.8014886 0.0000021 -0.0001173 -0.0001456 0.2846952 2.0737054 -0.4124555 -0.000075 -0.3354694 1.2930943 0.0000981 0.0000651 0.0000995 0.3267827 1.5157409 -0.0484926 0.0003473 -0.29396 0.6243586 0.0000626 0.0002645 0.0001146 -0.0452783 0.2242784 -0.0597777 -0.0000496 0.0000267 0.274802 0.0000063 -0.0000669 0.0000246 0.3653925 0.1656393 -0.0026172 0.0000122 -0.0087497 0.3026576 -0.0000194 0.0000126 0.0000299 0.3570556 0.2315136 0.0433768 0.0000227 0.0641573 0.1730385 -0.0000075 0.0000123 -0.0000056 0.3457342 unknown
polarizability: 169.7439461|0.6338663|102.5652966|0.0154136|0.0063655|37.5738096 unknown
InChI: InChI=1S/C5H3BrN4O2/c6-4-7-1-2(8-4)9-5(12)10-3(1)11/h7,9-10H
charge 0 multiplicity 1
15 atoms
Br 4.255503 0.313144 0.000726
O  -0.955253 -2.71168 -0.000064
O  -3.284499 1.38334 0.000034
N  1.652626 -0.94952 -0.000169
N  -0.940033 1.474221 0.00006
N  -2.062263 -0.623877 -0.000195
N  1.53972 1.332588 0.000146
C  0.293642 -0.620016 -0.000401
C  0.263272 0.784188 -0.000117
C  -0.894818 -1.44913 -0.000282
C  -2.174078 0.794527 0.000046
C  2.347499 0.25203 0.000197
H  2.040772 -1.893389 -0.000055
H  -0.961894 2.49583 0.000153
H  -2.962695 -1.114654 -0.000179
