program: Gaussian 09
title: 000280462
version: EM64L-G09RevD.01
frameworkgroup: C1[X(C16H16N2O5S)]
method: RPBEPBE
basis: SDD
operation: Freq
keyword: #p
keyword: freq=noraman
keyword: PBEPBE/SDD
title: #p freq=noraman PBEPBE/SDD
converged: YES YES NO NO
title: Mulliken charges:
elementType: S O O O O O N N C C C C C C C C C C C C C C C C H H H H H H H H H H H H H H H H
charge: 0.927931 -0.504078 -0.511562 -0.201019 -0.211855 -0.208562 -0.290264 0.021905 0.090000 0.327695 0.323483 -0.477169 0.355132 -0.538595 0.243515 -0.809579 -0.747727 -0.289113 -0.309272 -0.830982 -0.369030 -0.369723 0.387998 -0.230632 0.297827 0.285259 0.232998 0.251976 0.240407 0.297633 0.284459 0.276861 0.272039 0.272955 0.246844 0.237077 0.245302 0.289096 0.292992 0.197779
chargesum: 0.00000
title: Mulliken charges with hydrogens summed into heavy atoms:
elementType: S O O O O O N N C C C C C C C C C C C C C C C C
charge: 0.927931 -0.504078 -0.511562 -0.201019 -0.211855 -0.208562 -0.290264 0.021905 0.090000 0.327695 0.323483 -0.179342 0.355132 -0.253336 0.243515 -0.084198 0.111226 -0.017074 -0.036317 -0.101759 -0.079934 -0.076731 0.387998 -0.032853
polarizability: 4.40737798e+02 -3.37591226e+00 2.84984230e+02 9.08852536e-02 5.07216595e+00 1.84855604e+02
1716.lowfreq: -8.4034 -1.7112 -0.0014 -0.0010 0.0012 5.7181 19.9097 27.0674 32.5135
frequency: 19.5338 27.0338 32.5108 35.7984 51.0055 65.5786 69.8780 87.8484 94.9330 107.6737 131.0568 134.8875 135.5594 144.8478 149.0308 164.5744 181.6144 191.4543 200.6614 231.1093 246.5757 271.6898 283.8644 300.4882 306.6244 342.8836 359.7570 376.7707 402.8252 419.7142 453.0152 468.4265 476.4358 498.8301 505.7606 526.9124 565.9658 597.8260 616.8402 630.2424 654.0702 660.5854 677.5270 728.0463 737.0263 757.4886 774.3819 793.3867 817.6103 822.1897 851.6445 873.0259 877.4182 903.3708 923.7038 967.5158 978.5155 985.7977 987.6337 994.0996 995.4715 1004.7671 1019.8291 1045.2690 1047.9985 1076.0438 1094.9829 1117.6755 1157.5611 1180.1608 1190.8301 1219.6547 1232.2226 1269.7247 1295.4052 1299.2439 1305.2547 1351.8821 1357.1530 1379.1412 1383.2746 1396.4719 1401.0009 1407.0096 1413.4070 1418.6875 1433.3350 1452.7683 1464.2724 1469.9814 1477.1363 1481.4216 1483.3305 1542.1153 1564.5749 1583.0994 1594.2837 1618.5489 2926.6499 2986.8511 2987.0061 3034.8936 3064.5608 3065.4766 3095.8571 3100.9642 3138.1322 3151.5088 3165.7666 3178.5904 3181.7269 3184.8429 3190.9210 3197.0707
redmass: 6.1350 6.5124 6.9417 6.2929 6.7824 6.2195 1.0424 5.1818 4.9968 5.4575 4.9785 2.3028 2.4272 1.8026 1.5656 2.9688 7.9649 3.8116 3.1163 4.0860 4.2985 5.1861 4.5162 3.4356 7.5391 6.5185 6.9846 5.1475 4.1926 3.2953 4.4449 3.6138 4.4834 5.6915 4.2568 4.6468 7.8509 5.5863 6.8469 5.9804 5.3166 4.2003 5.7016 4.7290 4.9520 4.0905 8.7063 12.1432 4.2291 1.3732 1.7100 3.7138 3.9122 1.4295 1.3147 1.2702 1.3741 1.6256 1.5382 2.5621 1.5765 1.5869 1.4023 1.5930 1.5661 5.3819 3.0321 1.3009 3.1236 1.7478 2.0099 3.5103 4.3397 1.3477 4.1119 1.3765 1.1531 6.1938 3.6733 3.8988 6.0962 1.6302 1.2457 1.2747 1.0595 1.0651 4.7938 1.0911 2.1793 1.1519 1.0460 2.2462 1.2502 6.6134 7.5874 6.0926 6.2065 6.6235 1.0852 1.0382 1.0386 1.0245 1.0940 1.0977 1.0985 1.1005 1.0912 1.0920 1.0883 1.0893 1.1074 1.0964 1.1076 1.0970
irintensity: 1.6842 3.4864 1.2867 0.9547 1.3878 1.2699 0.7254 4.8993 3.1173 2.5254 1.0547 10.5477 5.7017 8.3829 5.4494 2.7241 5.3493 4.4160 2.7170 4.7723 0.3432 7.7883 2.6285 4.3985 30.7954 31.1402 21.4958 5.6733 12.1097 2.5339 8.0527 8.9136 8.2027 0.5833 12.7327 8.1222 37.9432 43.5231 2.4756 2.4472 15.8453 22.7546 20.2789 2.1762 6.1434 3.1018 18.6149 49.9086 48.5743 10.5838 51.8822 38.1086 7.1534 7.1337 5.6255 41.8665 3.5927 4.7633 4.4695 2.1197 0.9579 11.2683 0.9533 0.3414 8.3821 16.4110 27.7967 16.4095 74.2072 187.5240 30.4786 518.2107 11.9837 0.9587 11.4093 1.8273 5.4148 63.6207 12.2411 98.6044 28.8423 33.3857 19.6789 15.0419 17.5559 9.1805 29.2441 19.4305 5.8695 2.5238 10.7987 47.0573 7.5691 39.8350 5.2774 242.5072 26.0296 52.7293 110.4089 25.8582 12.3704 0.4940 11.6839 9.4678 10.6106 17.7786 2.2361 2.3566 1.6275 1.0474 0.1042 0.9377 0.2683 1.1698
temp: 298.150 k
press: 1.00000 atm
elementType: 16 8 8 8 8 8 7 7 6 6 6 6 6 6 6 6 6 6 6 6 6 6 6 6 1 1 1 1 1 1 1 1 1 1 1 1 1 1 1 1
symmnumber: 1
zpe: 762911.8 jmol-1
zpe.correction: 0.290578 hartree
zpe.thermalcorrener: 0.315636 hartree
zpe.thermalcorrenthalpy: 0.316580 hartree
zpe.thermalcorrgfe: 0.233057 hartree
zpe.sumelectzpe: -1500.993459 hartree
zpe.sumelectthermal: -1500.968400 hartree
zpe.sumelectthermalent: -1500.967456 hartree
zpe.sumelectthermalfe: -1501.050979 hartree
dipole: -4.8925 2.0126 2.1525
dipole: 5.7114
quadrupole: -205.4443 -145.1867 -144.4444
quadrupole: 0.8579 10.1976 17.8850
quadrupole: -40.4192 19.8384 20.5807 0.8579 10.1976 17.8850
hfenergy: -1501.2840364 hartree
pointgroup: C01 [X(C16H16N2O5S1)]
dipole: -1.7833257 0.7682586 1.1307933 debye
polarizability: 437.7041541|-11.557562|281.9233459|-22.074532|21.7059825|190.9501324 unknown
InChI: InChI=1S/C15H13N2O3.CH3O2S/c1-10-8-15(11(2)7-12(10)9-18)16-13-3-5-14(6-4-13)17(19)20;1-4(2)3/h3-9H,1-2H3;1H3
charge 0 multiplicity 1
40 atoms
S  0.019815 2.854885 -0.295874
O  -1.103922 2.843273 -1.489624
O  1.500233 3.495611 -0.575078
O  -5.784797 -1.644871 0.881746
O  5.132931 -2.817756 -1.294764
O  6.238724 -0.94321 -0.600382
N  0.215982 0.803746 0.68351
N  5.156303 -1.621092 -0.802856
C  -1.054058 0.199216 0.454066
C  -1.894804 -0.026094 1.597395
C  1.404709 0.203666 0.231514
C  -1.525396 -0.090869 -0.859232
C  -2.815119 -0.613452 -1.091117
C  -3.171523 -0.565893 1.35965
C  -3.64272 -0.85944 0.050377
C  -1.402774 0.249856 3.002548
C  -0.749757 3.779698 1.183634
C  1.446782 -1.12194 -0.319126
C  2.639161 0.905369 0.436282
C  -3.274307 -0.876067 -2.516252
C  2.67091 -1.720624 -0.644919
C  3.861002 0.317131 0.086773
C  3.867548 -0.991585 -0.451486
C  -5.016975 -1.411334 -0.09271
H  -0.877813 0.134734 -1.712374
H  -3.84865 -0.775691 2.195932
H  -2.239454 0.255658 3.720834
H  -0.682801 -0.524512 3.328482
H  -0.864208 1.211395 3.062103
H  -0.927536 4.807062 0.836009
H  -1.682555 3.252398 1.424156
H  -0.011498 3.7265 1.994093
H  0.518733 -1.685052 -0.446608
H  2.620221 1.907863 0.867857
H  -2.482142 -0.60272 -3.23183
H  -3.525816 -1.939541 -2.683936
H  -4.168864 -0.280578 -2.774859
H  2.722839 -2.735483 -1.047861
H  4.808385 0.842228 0.230566
H  -5.359083 -1.619282 -1.132938
