program: Gaussian 09
title: 000280433
version: EM64L-G09RevD.01
frameworkgroup: C1[X(C8H12N2O2S)]
method: RPBEPBE
basis: SDD
operation: Freq
keyword: #p
keyword: freq=noraman
keyword: PBEPBE/SDD
title: #p freq=noraman PBEPBE/SDD
converged: YES YES NO NO
title: Mulliken charges:
elementType: S O O N N C C C C C C C C H H H H H H H H H H H H
charge: 0.780112 -0.636434 -0.620058 0.034855 -0.403779 -0.221950 -0.214093 -0.199956 0.450358 -0.381656 -0.354891 -0.645780 -0.801548 0.285052 0.272690 0.237914 0.238184 0.223125 0.259106 0.256821 0.229821 0.226914 0.239879 0.314001 0.431314
chargesum: 0.00000
title: Mulliken charges with hydrogens summed into heavy atoms:
elementType: S O O N N C C C C C C C C
charge: 0.780112 -0.636434 -0.188744 0.034855 -0.089778 -0.221950 0.070959 0.072734 0.450358 -0.143742 -0.116707 0.093272 -0.104934
polarizability: 1.78912497e+02 4.87066180e+00 1.15747053e+02 -8.05796673e+00 1.27831930e+01 1.16274254e+02
1716.lowfreq: -31.9113 -16.2160 -4.6769 -0.0020 0.0005 0.0020 10.6589 17.1785 36.5547
frequency: -31.5917 17.0367 36.5090 60.9019 95.0882 109.3075 124.0362 160.1575 182.0513 209.0960 223.5767 268.8260 281.8627 289.2860 352.6882 368.0991 403.7851 415.0577 509.4207 573.5585 581.2266 589.2825 624.7756 714.6808 766.6807 779.5409 819.4531 846.8882 859.6610 869.1864 957.9721 977.1977 986.7675 999.2738 1048.1354 1051.2714 1055.3433 1101.2162 1115.8218 1172.0527 1184.6681 1218.2958 1294.1491 1329.3016 1375.2788 1376.9294 1391.2817 1398.1411 1432.5055 1448.9746 1470.2179 1473.1390 1473.7289 1495.9192 1572.0839 1587.2266 1599.1122 2204.8374 2736.9926 2947.7210 2978.9481 3060.2638 3072.6027 3089.7370 3090.7572 3127.7046 3129.6204 3152.2709 3159.8318
redmass: 1.0149 4.7775 3.8910 4.3921 4.5196 4.4675 2.3806 2.5221 6.1184 5.2107 1.8702 7.1577 5.8211 4.7118 9.4242 3.3006 3.0111 5.4752 3.1531 5.3992 4.3402 4.6725 7.0548 3.3192 15.4383 4.8236 1.3569 1.2394 4.1333 1.1446 1.3070 1.3778 1.4469 4.5112 1.5804 2.0985 1.3124 1.4342 1.2912 1.3049 1.1401 2.9558 1.2726 1.2486 4.8142 1.2006 3.3711 1.2277 1.0474 1.0796 1.0871 2.2046 1.1019 1.2112 4.2200 6.6671 6.0410 1.0726 1.0791 1.0368 1.0386 1.0952 1.0971 1.0997 1.0992 1.0886 1.0891 1.0953 1.0959
irintensity: 0.6123 1.6661 0.5746 0.9567 5.9488 16.7367 4.2012 3.0127 14.3470 4.9786 21.4554 21.8538 10.2335 1.9242 3.4048 2.8415 2.9334 25.2418 35.4220 38.1157 13.2301 25.2504 1.4124 2.7737 47.2171 0.4535 55.2711 1.4819 21.1328 13.0165 4.8488 0.9888 0.5719 4.1932 27.6274 78.9862 72.4086 4.4523 9.9281 137.0195 7.6174 4.4226 1.5391 151.9606 1.1788 15.8109 7.4083 13.5456 16.4367 75.1839 15.0850 20.0168 13.8948 74.0817 3.3640 0.0429 9.7042 1955.4422 106.2244 18.4544 28.8224 19.8042 14.7300 16.4315 6.9046 15.0043 9.8269 8.1502 6.4395
temp: 298.150 k
press: 1.00000 atm
elementType: 16 8 8 7 7 6 6 6 6 6 6 6 6 1 1 1 1 1 1 1 1 1 1 1 1
symmnumber: 1
zpe: 493274.2 jmol-1
zpe.correction: 0.187878 hartree
zpe.thermalcorrener: 0.202234 hartree
zpe.thermalcorrenthalpy: 0.203178 hartree
zpe.thermalcorrgfe: 0.144508 hartree
zpe.sumelectzpe: -968.930128 hartree
zpe.sumelectthermal: -968.915773 hartree
zpe.sumelectthermalent: -968.914828 hartree
zpe.sumelectthermalfe: -968.973498 hartree
dipole: 1.8672 3.7872 1.0828
dipole: 4.3591
quadrupole: -66.7194 -81.2155 -90.2693
quadrupole: -7.9308 -6.5111 3.4883
quadrupole: 12.6820 -1.8141 -10.8679 -7.9308 -6.5111 3.4883
hfenergy: -969.1180064 hartree
pointgroup: C01 [X(C8H12N2O2S1)]
dipole: -0.5140637 -1.6269687 0.1731872 debye
dipolederiv: 1.0020685 0.2861275 0.0589821 0.2306153 0.6773174 0.0905698 0.016823 0.1553496 0.9085205 -0.7861507 -0.0361787 -0.2130241 0.1898852 -0.4890217 0.1447309 -0.0442639 -0.219969 -0.6782228 -1.1591292 -0.0440894 0.1019112 0.4191425 -0.6875341 -0.1153864 0.1583662 0.1171291 -0.5850417 -0.2140777 -0.1192498 0.1382574 -0.0979239 -0.0690492 -0.2105692 0.3028136 -0.2643402 0.0618499 -0.3892577 0.1061242 -0.2388871 0.1270602 -0.3548599 0.1000136 -0.0944286 0.0054891 -0.0800487 -0.125624 0.0838039 0.037089 -0.0343244 -0.1783034 -0.0462987 -0.0020772 -0.0437667 -0.1110738 -0.1522395 -0.0379738 0.0634392 0.0551049 -0.0522023 0.0175218 -0.1728619 -0.1071415 -0.0744955 -0.1008977 0.0576212 -0.0786453 -0.1276247 -0.084032 -0.1137196 0.1166624 0.0219244 0.019036 0.2879457 0.2463199 0.1335678 0.2097805 0.1594939 0.0869103 0.1147911 0.087674 0.0491946 -0.1987446 0.0260584 -0.0754884 0.010439 -0.0372491 -0.1521686 -0.0931964 -0.1505297 -0.0471448 -0.1994349 -0.0448841 0.0696435 -0.0719486 -0.185553 -0.0451773 0.0706844 -0.0453682 0.0844271 -0.0007825 0.1469531 -0.0894685 0.210474 0.0250126 0.1194771 -0.2570152 0.2074475 0.0469972 -0.1370747 -0.1511371 -0.0842385 -0.0545827 0.0238082 -0.0327983 -0.0607406 -0.0563461 0.0493636 0.16619 -0.0007486 -0.0737125 0.0077339 0.1191035 0.0043359 -0.0383426 0.0239167 0.0367014 0.1432846 -0.0753903 0.0358314 -0.0347879 0.0614273 0.0614409 0.0247939 0.0426431 0.078367 0.0701475 -0.090869 0.0137311 -0.1138645 -0.0186276 0.0914792 0.0158445 0.0844053 0.0322449 0.0642702 -0.0346439 -0.0928563 -0.0498739 0.1002149 -0.0013197 -0.1073641 0.0141373 -0.0780565 -0.004822 0.0417714 0.1381185 0.0873716 0.0577859 -0.0215816 0.0039562 0.0636152 -0.1027565 -0.0394953 -0.051166 -0.0242725 -0.0799196 0.1030477 -0.0135408 -0.0634063 0.0702079 0.0927918 0.1560742 -0.0308413 0.0124201 0.0428272 -0.0514693 -0.0305588 -0.066071 -0.0536553 0.0582384 0.0899075 -0.0040277 0.0516318 -0.0503386 0.0577968 -0.026551 -0.0061431 -0.0871629 -0.1231854 0.0970646 0.0200186 -0.0299175 -0.0537149 -0.086139 0.0571364 -0.0042717 0.1371727 0.0208605 -0.144957 0.0140608 -0.012791 0.0491216 0.0321937 -0.0302053 0.0027732 -0.0250498 0.105062 0.5603665 -0.0585973 0.1096345 -0.1183104 0.2970665 0.0251281 -0.1180643 0.1332515 0.032993 1.0153681 -0.2490619 0.0490442 -0.7523417 0.5797722 0.0411314 0.3007386 -0.111034 0.2033779 unknown
polarizability: 166.9415834|16.6520258|121.2958315|23.8629718|-7.1012229|122.696389 unknown
InChI: InChI=1S/C7H8O2S.CH4N2/c1-6-2-4-7(5-3-6)10(8)9;1-3-2/h2-5,8H,1H3;2H,1H3
charge 0 multiplicity 1
25 atoms
S  0.142112 2.7561 1.069906
O  0.913574 1.879572 2.27752
O  1.2241 2.832682 -0.384826
N  3.767643 0.241553 0.254535
N  2.729156 0.944385 0.46935
C  -1.093985 1.47887 0.412484
C  -1.510483 0.451332 1.277137
C  -1.585506 1.59862 -0.901596
C  -2.983466 -0.397495 -0.510686
C  -2.454818 -0.487197 0.803225
C  -2.528546 0.650954 -1.355429
C  4.306058 -0.558997 1.401086
C  -4.022918 -1.389469 -1.001145
H  -1.079468 0.380346 2.281862
H  -1.21182 2.386275 -1.563863
H  -2.785377 -1.297649 1.463642
H  -2.910907 0.722605 -2.380704
H  3.716994 -0.449878 2.335299
H  5.349596 -0.236653 1.565833
H  4.333349 -1.616242 1.082787
H  -3.872982 -1.640824 -2.066053
H  -3.995723 -2.327254 -0.419883
H  -5.04357 -0.970859 -0.905164
H  2.264456 0.96637 1.447946
H  1.919031 2.008853 -0.288462
