program: Gaussian 09
title: 000280419
version: EM64L-G09RevD.01
frameworkgroup: C1[X(C11H17N3O)]
method: RPBEPBE
basis: SDD
operation: Freq
keyword: #p
keyword: freq=noraman
keyword: PBEPBE/SDD
title: #p freq=noraman PBEPBE/SDD
converged: YES YES NO NO
title: Mulliken charges:
elementType: O N N N C C C C C C C C C C C H H H H H H H H H H H H H H H H H
charge: -0.254769 0.050075 -0.416636 -0.653695 -0.144106 -0.172533 -0.184280 -0.297600 -0.521726 -0.490182 -0.479080 -0.578867 0.122342 -0.452773 0.285656 0.237676 0.247552 0.235461 0.274475 0.233139 0.236739 0.213995 0.210426 0.208537 0.252594 0.232769 0.228823 0.223534 0.225384 0.288108 0.342209 0.296752
chargesum: 0.00000
title: Mulliken charges with hydrogens summed into heavy atoms:
elementType: O N N N C C C C C C C C C C C
charge: -0.254769 0.050075 -0.128528 -0.014735 0.093570 0.075019 0.051180 -0.023125 -0.051848 -0.065760 -0.017949 -0.117275 0.122342 -0.003854 0.285656
polarizability: 1.78305894e+02 1.04488087e+01 1.14857306e+02 2.26854837e+00 -2.74556992e+00 1.24747630e+02
1716.lowfreq: -21.6247 -0.0004 0.0005 0.0010 3.0262 9.6030 31.8480 41.1401 83.5117
frequency: 31.8177 40.4569 83.4719 120.9924 133.9017 206.9407 229.2049 235.5269 274.0204 307.7196 324.0638 384.3404 440.4792 441.4373 478.6000 490.5685 520.1485 533.4818 561.0323 585.5571 618.6744 668.3847 704.5887 710.6922 749.8541 786.8434 792.7034 834.4526 844.2054 887.4007 896.0597 916.7371 926.4030 929.7660 940.9934 957.3565 978.7596 991.3143 1014.8474 1038.7357 1070.4612 1072.8413 1083.7230 1096.8191 1102.7048 1113.7479 1134.4202 1136.5502 1161.5208 1180.2177 1199.3991 1221.7845 1234.7126 1253.7070 1262.1829 1272.1592 1278.0237 1285.7550 1292.2865 1300.8756 1304.9643 1320.6889 1324.5922 1336.7212 1448.7493 1463.1365 1468.6690 1478.8272 1487.5328 1493.0322 1601.8330 1640.0199 1679.3306 2959.1583 2982.5637 2988.7062 2999.6655 3001.1633 3009.3274 3018.9493 3020.6902 3036.1215 3053.3128 3061.3340 3069.9676 3079.8086 3098.5089 3409.7929 3537.0153 3696.1477
redmass: 5.2488 3.7806 3.3854 5.2264 3.6550 2.2104 1.4038 5.2491 2.2847 2.7032 3.2020 2.4868 1.8510 2.1063 1.5905 2.0146 1.7694 3.5393 2.1642 5.3162 2.3659 5.6014 3.6124 8.5234 2.2470 3.3330 3.0412 2.0652 2.9425 2.1683 2.5356 2.6988 2.3414 1.9209 2.0591 2.0386 2.0649 1.7431 1.5623 2.4017 1.9760 1.8266 1.3979 1.5574 1.5911 1.3679 1.5676 1.5452 1.5763 1.6162 2.2639 1.6060 1.5871 1.4522 1.3795 1.6130 1.4028 1.4944 2.3811 1.3949 1.4747 1.4170 1.4354 1.5876 1.1042 1.0859 1.0807 1.1167 1.0930 1.7245 1.2160 11.6045 5.3898 1.0624 1.0633 1.0683 1.0721 1.0708 1.0597 1.0968 1.0854 1.1007 1.1007 1.0899 1.1041 1.1064 1.0910 1.0751 1.0458 1.1035
irintensity: 13.7535 4.7326 4.1127 3.0147 2.7186 0.1235 3.3993 0.8149 3.4262 17.0152 2.4442 37.4135 32.8056 69.1393 167.2279 24.8983 38.0522 14.2182 38.0357 3.7544 5.5951 5.5860 0.1864 18.1630 3.1056 0.3541 0.7314 5.5089 2.7691 3.3126 3.8322 1.2645 3.9151 0.0954 1.8860 6.8581 2.7853 4.3388 6.0053 18.9138 47.2949 26.0122 1.2309 36.4482 17.8839 1.1870 31.7847 0.7167 4.0030 12.3021 8.5858 3.1566 4.5120 3.5318 1.2175 11.7804 7.6453 2.8290 353.8993 6.8929 0.8707 1.0727 1.8214 1.5235 52.7539 21.3654 3.9843 19.4075 13.1792 339.3163 135.4090 6.6323 325.6284 21.0262 23.4827 10.6270 40.4071 51.2840 40.2027 31.7047 48.2117 21.9036 23.1134 67.4444 84.1622 49.7311 19.7630 15.4667 40.7999 40.4035
temp: 298.150 k
press: 1.00000 atm
elementType: 8 7 7 7 6 6 6 6 6 6 6 6 6 6 6 1 1 1 1 1 1 1 1 1 1 1 1 1 1 1 1 1
symmnumber: 1
zpe: 714390.4 jmol-1
zpe.correction: 0.272097 hartree
zpe.thermalcorrener: 0.285554 hartree
zpe.thermalcorrenthalpy: 0.286498 hartree
zpe.thermalcorrgfe: 0.231468 hartree
zpe.sumelectzpe: -667.681716 hartree
zpe.sumelectthermal: -667.668259 hartree
zpe.sumelectthermalent: -667.667315 hartree
zpe.sumelectthermalfe: -667.722345 hartree
dipole: -2.3683 -1.1877 5.6369
dipole: 6.2285
quadrupole: -86.0037 -89.5857 -89.0420
quadrupole: -1.5979 20.7454 -0.5271
quadrupole: 2.2067 -1.3752 -0.8315 -1.5979 20.7454 -0.5271
hfenergy: -667.9538132 hartree
pointgroup: C01 [X(C11H17N3O1)]
dipole: 0.9311869 0.4300263 2.2254835 debye
polarizability: 177.8011999|11.8891656|115.2101317|-2.2552022|2.3964238|124.8994987 unknown
InChI: InChI=1S/C11H17N3O/c12-11(15)14-13-10-5-6-4-9(10)8-3-1-2-7(6)8/h6-9,14H,1-5,12H2
charge 0 multiplicity 1
32 atoms
O  -3.898745 -0.490934 -1.192552
N  -1.268637 0.363144 -0.596367
N  -2.24789 0.160608 0.376309
N  -4.429862 -0.314277 1.072048
C  2.694682 -0.044789 0.433573
C  2.099598 -0.233242 -1.024555
C  1.962379 1.239943 0.9546
C  1.075806 0.958117 -1.138625
C  1.852141 2.070735 -0.363447
C  2.454828 -1.392066 1.17396
C  1.532041 -1.676789 -1.095001
C  0.45807 0.946622 1.244056
C  -0.076351 0.708642 -0.180457
C  1.34047 -2.133421 0.378965
C  -3.54865 -0.230875 -0.013742
H  3.776656 0.182342 0.395698
H  2.872984 -0.077537 -1.800158
H  2.47734 1.730409 1.797124
H  0.75246 1.174999 -2.166776
H  2.834539 2.297763 -0.814271
H  1.279225 3.008165 -0.246662
H  2.198666 -1.254259 2.242009
H  3.383792 -1.993221 1.145861
H  2.262785 -2.33801 -1.598622
H  0.589033 -1.724096 -1.668684
H  -0.022755 1.831288 1.71297
H  0.305157 0.086035 1.923325
H  0.336137 -1.840964 0.736444
H  1.410944 -3.230993 0.488526
H  -2.029451 0.289733 1.373127
H  -5.378619 -0.612205 0.860563
H  -4.199872 -0.035866 2.02376
