program: Gaussian 09
title: 000280435
version: EM64L-G09RevD.01
frameworkgroup: C1[X(C20H26N2O2)]
method: RPBEPBE
basis: SDD
operation: Freq
keyword: #p
keyword: freq=noraman
keyword: PBEPBE/SDD
title: #p freq=noraman PBEPBE/SDD
converged: YES YES NO NO
title: Mulliken charges:
elementType: O O N N C C C C C C C C C C C C C C C C C C C C H H H H H H H H H H H H H H H H H H H H H H H H H H
charge: -0.460487 -0.279362 -0.089468 -0.180473 -0.369836 -0.359528 -0.404398 -0.382315 -0.388697 -0.064005 0.507078 -0.558865 0.470384 -0.518754 -0.412395 0.343225 -0.215023 -0.380208 -0.454307 -0.404054 -0.232043 -0.220991 -0.248342 -0.536041 0.190562 0.210033 0.212506 0.188831 0.210287 0.221733 0.206917 0.214944 0.179640 0.220467 0.211435 0.221212 0.231943 0.257254 0.217642 0.334855 0.215615 0.275602 0.230878 0.239928 0.220821 0.221558 0.224520 0.219650 0.219106 0.240967
chargesum: 0.00000
title: Mulliken charges with hydrogens summed into heavy atoms:
elementType: O O N N C C C C C C C C C C C C C C C C C C C C
charge: -0.125632 -0.279362 -0.089468 -0.180473 0.030759 0.041809 0.027621 0.039546 0.011410 0.147430 0.507078 -0.105710 0.470384 -0.261500 -0.194753 0.343225 0.000592 -0.104606 -0.223429 -0.164126 -0.011222 0.000567 -0.023822 0.143681
polarizability: 3.19511424e+02 1.44283038e+01 2.46692112e+02 -2.24875165e+01 1.07387845e+01 1.56592341e+02
1716.lowfreq: -9.3655 -4.3377 -0.0008 0.0002 0.0005 5.7152 12.9147 15.4372 25.7475
frequency: 12.4125 14.8859 25.6733 35.9742 51.3068 61.7058 72.9797 92.1819 105.0998 135.3289 149.3631 194.0775 210.0171 217.3680 237.1661 257.3599 259.5607 261.8032 282.1360 293.1182 296.6189 317.3754 361.9915 384.4995 396.1758 405.6421 423.6732 444.7922 453.9115 469.8067 495.9816 501.0627 546.8468 559.1088 597.9657 607.2101 617.8998 636.9087 684.0177 694.1101 706.4332 749.6586 755.1684 779.3665 804.8173 813.2715 832.1506 841.3109 843.7904 853.1687 857.2659 889.7486 922.5590 941.0864 949.4740 952.8062 977.5392 979.1572 989.8843 995.1890 998.6335 1005.6392 1024.7437 1028.3476 1046.1375 1051.7821 1059.9577 1075.1469 1081.9283 1092.4150 1096.5319 1111.9513 1142.7238 1147.5187 1152.2200 1165.2623 1170.6240 1175.5881 1178.4877 1187.6994 1193.1062 1207.4440 1214.4777 1232.7030 1250.3538 1255.6699 1281.1011 1298.7669 1300.5104 1302.5921 1316.1013 1330.3809 1342.8663 1349.1325 1355.6544 1365.5605 1375.0795 1379.0126 1381.7318 1394.0793 1397.0178 1433.0594 1437.9416 1450.3806 1452.0586 1457.0785 1459.0973 1463.2161 1464.5785 1466.3087 1473.5526 1475.0501 1483.7385 1491.8460 1577.0726 1591.1538 1614.4423 1623.7296 2826.0522 2854.8879 2867.6771 2909.0576 2919.5902 2956.2698 2963.1708 2984.7970 3029.2563 3037.8488 3042.4110 3046.2482 3054.8210 3057.1282 3092.1662 3112.0730 3119.7393 3121.5696 3128.3127 3135.5730 3151.7352 3160.1173 3163.3111 3173.9640 3179.4479 3549.6792
redmass: 4.8654 4.7514 3.8309 4.0990 3.1765 4.4038 3.8289 3.7719 4.3393 4.0638 4.1186 1.7444 3.4194 3.0719 3.1713 1.9138 2.3610 2.6201 1.4141 2.7407 2.8916 2.3250 3.6640 2.2560 3.4784 2.8344 2.5736 2.9083 3.0196 3.1227 3.8113 3.1870 5.0469 4.6624 3.9875 3.3402 6.2285 2.8959 1.7617 4.0799 1.8521 1.8744 1.5712 3.7332 3.0291 4.0731 1.5251 2.6901 1.7002 1.6625 1.2482 1.9363 1.4547 3.3684 1.5597 1.9119 5.6816 1.3961 4.9984 1.3910 2.6970 2.6396 3.5390 2.1985 1.8895 1.8362 1.9838 2.3652 1.6519 1.9120 1.9870 1.2595 2.5570 2.7698 1.4315 1.1786 1.0760 1.8831 1.5029 1.1184 1.4077 1.1456 2.3780 1.7501 1.4692 1.3160 1.3887 1.3300 1.2973 1.3627 1.3977 1.2803 1.3181 1.4020 1.9516 1.4349 1.6527 1.5654 4.8200 2.0995 2.3986 1.3410 1.9105 1.8736 1.2301 1.1242 1.1421 1.1250 1.0504 1.1073 1.1112 1.0892 2.3207 2.5613 5.8792 6.0109 6.1206 6.5921 1.0709 1.0710 1.0696 1.0693 1.0710 1.0329 1.0824 1.0631 1.0888 1.0889 1.1037 1.0895 1.0991 1.0897 1.0891 1.0863 1.0992 1.0870 1.0868 1.0930 1.0961 1.0919 1.0997 1.0952 1.0909 1.0659
irintensity: 0.0435 0.0727 0.0526 0.6372 1.3664 0.2547 2.8125 6.3786 0.5248 3.3823 3.0170 0.7908 0.4302 1.5189 2.0437 0.7336 4.7288 5.0868 114.9414 15.2461 15.2405 2.0567 13.3493 0.7993 1.5581 0.1070 18.0184 6.7968 4.0832 0.6275 4.1968 13.7933 3.6208 8.9153 5.8100 1.2597 0.4616 8.6548 28.9733 6.3134 50.8192 52.9688 44.1188 0.1452 7.0237 8.8722 2.1887 18.7975 8.6184 32.6110 0.2816 14.4710 1.6877 9.8239 2.8709 4.2193 12.2120 0.8635 1.1082 0.6479 69.5001 76.6754 74.9011 9.6726 46.9444 6.8431 3.2516 7.7746 13.8456 23.5505 6.7322 0.2384 52.1599 41.1113 22.4957 6.2650 1.7407 45.6409 139.4052 0.2742 95.5811 28.2031 1.3195 22.5765 80.3875 2.1582 35.1437 7.2052 18.6524 6.2631 3.0241 8.8470 2.2768 1.8692 17.6762 1.7192 31.0332 50.1358 0.7863 9.5323 17.4652 10.1951 8.2652 14.3915 3.2025 8.5804 16.6572 3.3118 12.0820 80.3568 4.9400 26.6773 25.8797 133.4589 98.9580 0.6429 13.6999 342.9501 84.7277 55.7396 144.0478 56.2566 111.8090 78.4419 24.7563 22.9272 9.5879 64.9141 51.5437 44.2286 8.5987 23.2331 22.6021 9.3155 27.6539 1.8652 13.1784 37.9324 27.9419 24.3384 16.5837 15.4706 1.3973 6.9391
temp: 298.150 k
press: 1.00000 atm
elementType: 8 8 7 7 6 6 6 6 6 6 6 6 6 6 6 6 6 6 6 6 6 6 6 6 1 1 1 1 1 1 1 1 1 1 1 1 1 1 1 1 1 1 1 1 1 1 1 1 1 1
symmnumber: 1
zpe: 1105749.3 jmol-1
zpe.correction: 0.421158 hartree
zpe.thermalcorrener: 0.444172 hartree
zpe.thermalcorrenthalpy: 0.445117 hartree
zpe.thermalcorrgfe: 0.365445 hartree
zpe.sumelectzpe: -1035.836926 hartree
zpe.sumelectthermal: -1035.813911 hartree
zpe.sumelectthermalent: -1035.812967 hartree
zpe.sumelectthermalfe: -1035.892639 hartree
dipole: 2.0982 -1.0746 0.9079
dipole: 2.5261
quadrupole: -139.8134 -133.4166 -142.0035
quadrupole: 5.3112 -9.4443 0.1458
quadrupole: -1.4022 4.9946 -3.5923 5.3112 -9.4443 0.1458
hfenergy: -1036.2580838 hartree
pointgroup: C01 [X(C20H26N2O2)]
dipole: -0.8352307 -0.4325355 -0.3210366 debye
polarizability: 318.5408821|-16.9624813|245.4898085|-23.647075|-15.6578587|158.7651865 unknown
InChI: InChI=1S/C20H26N2O2/c1-24-20-9-5-8-18(15-20)22-12-10-21(11-13-22)16-19(23)14-17-6-3-2-4-7-17/h2-9,15,19,23H,10-14,16H2,1H3
charge 0 multiplicity 1
50 atoms
O  4.346688 -2.249845 -1.082326
O  -5.453164 2.37305 -0.853249
N  0.74583 -1.674377 -0.023839
N  -2.06681 -0.967448 0.072891
C  0.076675 -1.03153 -1.180592
C  -0.228769 -2.52772 0.698857
C  -1.116871 -0.171906 -0.727465
C  -1.411056 -1.680117 1.194675
C  1.986758 -2.392005 -0.389654
C  3.184433 -1.441958 -0.64419
C  -3.40386 -0.514727 0.216169
C  3.617192 -0.700927 0.634707
C  4.476986 0.531607 0.390635
C  -3.830827 0.719659 -0.344548
C  -4.377562 -1.313112 0.899047
C  -5.180564 1.131469 -0.247129
C  -5.709558 -0.878032 0.995672
C  5.760674 0.423774 -0.20942
C  4.009399 1.819256 0.760023
C  -6.143318 0.343455 0.425833
C  6.54984 1.573613 -0.433879
C  4.7980 2.972095 0.537552
C  6.073081 2.852825 -0.060782
C  -6.824111 2.876589 -0.766554
H  -0.28778 -1.801222 -1.908508
H  0.795226 -0.378582 -1.707076
H  0.276171 -2.986189 1.568991
H  -0.618137 -3.350317 0.046647
H  -0.739405 0.707086 -0.154436
H  -1.630873 0.201025 -1.630023
H  -2.136001 -2.336609 1.699303
H  -1.033436 -0.948197 1.94538
H  1.84163 -3.039016 -1.295739
H  2.265176 -3.064089 0.444128
H  2.928002 -0.704358 -1.434126
H  4.161745 -1.438978 1.257178
H  2.692665 -0.421217 1.172126
H  -3.139002 1.403266 -0.84167
H  -4.104792 -2.284248 1.321424
H  4.144146 -2.660569 -1.961548
H  -6.438343 -1.51157 1.514669
H  6.122059 -0.567373 -0.502703
H  3.021379 1.918017 1.227329
H  -7.188488 0.651396 0.510933
H  7.538886 1.472999 -0.896327
H  4.420181 3.95806 0.832448
H  6.688197 3.743741 -0.231955
H  -7.13394 3.027331 0.286294
H  -7.538076 2.19272 -1.266216
H  -6.809581 3.843906 -1.290556
