program: Gaussian 09
title: 000280456
version: EM64L-G09RevD.01
frameworkgroup: C1[X(C17H17ClFN3O6S)]
method: RPBEPBE
basis: SDD
operation: Freq
keyword: #p
keyword: freq=noraman
keyword: PBEPBE/SDD
title: #p freq=noraman PBEPBE/SDD
converged: YES YES NO NO
title: Mulliken charges:
elementType: Cl S F O O O O O O N N N C C C C C C C C C C C C C C C C C H H H H H H H H H H H H H H H H H
charge: -0.011306 1.071217 -0.349862 -0.253630 -0.313081 -0.476839 -0.480138 -0.214806 -0.215101 -0.403728 -0.502278 0.019136 -0.349041 -0.389538 -0.322906 0.592598 0.529918 -0.328963 -0.644090 -0.343866 -0.224099 0.320209 -0.801938 0.517790 -0.303215 -0.330044 0.400955 -0.369475 -0.398845 0.204368 0.243759 0.231860 0.264987 0.251224 0.236246 0.235434 0.297193 0.319215 0.294512 0.303166 0.277051 0.276758 0.220706 0.318728 0.310812 0.288945
chargesum: 0.00000
title: Mulliken charges with hydrogens summed into heavy atoms:
elementType: Cl S F O O O O O O N N N C C C C C C C C C C C C C C C C C
charge: -0.011306 1.071217 -0.349862 -0.253630 -0.313081 -0.476839 -0.480138 -0.214806 -0.215101 -0.106535 -0.199113 0.019136 0.099086 0.107309 0.164564 0.592598 0.529918 -0.328963 -0.408656 -0.024650 0.070413 0.320209 -0.027423 0.517790 -0.303215 -0.011315 0.400955 -0.058663 -0.109900
polarizability: 3.93041136e+02 2.44138818e+01 3.33925032e+02 -1.03950750e+00 -7.47841018e+00 1.54856528e+02
1716.lowfreq: -6.8792 -4.1252 -0.0013 0.0008 0.0019 1.0155 3.2179 11.1384 19.5659
frequency: -5.4066 11.0348 19.5410 25.3181 33.0379 48.8494 54.7786 60.1256 71.1511 80.2804 92.8087 99.4668 111.9922 119.7235 139.7924 162.9556 165.8386 172.9478 179.3787 195.0230 221.5194 227.5087 252.5902 261.7547 273.3474 277.4799 297.6391 311.6790 324.7685 329.2323 339.1685 353.7533 377.7639 397.8199 419.8031 428.4639 445.3265 447.6020 464.2973 479.1919 495.4505 523.7022 530.9490 550.6300 552.7687 572.5335 614.8737 617.3116 638.0108 675.1585 688.6113 690.1333 702.7969 710.4247 726.9279 730.5420 757.2488 825.5102 834.1233 850.6709 851.4730 858.1449 863.6614 880.4408 899.0237 919.0509 927.8106 958.2003 981.8301 985.8880 989.7725 994.2483 997.8467 1027.5054 1028.4893 1052.5129 1073.6295 1100.3437 1103.0725 1112.4478 1146.8099 1152.9787 1195.7148 1206.4037 1211.6646 1218.0607 1235.5653 1261.4563 1267.1767 1275.7658 1300.4890 1311.5094 1350.5767 1353.4917 1361.5310 1362.9999 1372.6328 1390.6220 1395.2336 1412.5625 1418.0188 1437.0372 1454.1220 1459.2183 1463.8633 1476.1854 1485.7031 1487.4185 1499.8547 1514.6039 1576.4767 1587.0056 1598.4463 1603.8398 1644.6492 2994.7085 2996.2008 3018.7941 3027.9050 3058.7039 3080.3574 3082.2113 3102.5556 3106.9833 3117.1229 3143.4256 3160.1149 3186.4275 3188.7319 3207.6468 3525.4733 3546.8331
redmass: 9.1465 6.7918 9.5741 5.9391 8.5341 6.7353 4.8640 9.9834 5.2627 5.8418 8.6213 7.2193 1.3167 4.4883 7.4485 5.8905 12.0742 5.5761 4.5750 6.2308 3.5074 7.4647 3.8929 3.8243 6.4589 5.2744 5.8834 7.9208 9.1097 4.3242 5.6499 3.9424 3.6386 1.8709 5.3671 2.6965 3.0185 3.4999 3.3938 4.7347 4.3835 8.5898 4.7600 5.4932 7.2726 2.4955 7.1417 1.4681 6.0892 6.6318 4.5733 6.9608 5.5295 3.7752 7.0459 5.0845 4.9941 4.0192 3.5347 5.1476 1.5223 2.0026 1.6732 1.6199 3.5807 1.4216 2.5204 4.3864 7.1289 6.1403 1.3334 1.4374 2.0244 2.8029 2.0261 1.5296 2.6403 2.5204 3.3534 2.6820 1.4509 1.3127 1.6315 1.5785 3.8817 1.4388 1.7128 1.7005 1.6848 1.6407 1.1610 2.1736 2.5720 1.8994 1.8251 2.2639 1.3180 8.1642 3.6721 1.2775 5.4362 1.0843 1.1401 1.1283 2.1192 2.5585 1.1556 1.1889 1.6145 2.4397 7.6909 5.1461 7.0122 6.3336 4.0030 1.0617 1.0370 1.0627 1.0605 1.0983 1.0971 1.1037 1.1073 1.1003 1.0915 1.0923 1.0916 1.0939 1.0933 1.0947 1.0764 1.0775
irintensity: 1.5426 0.2799 0.4141 0.9131 0.6457 0.5714 3.8440 0.4634 4.8755 1.4024 1.7533 2.4672 1.6257 7.4009 1.8628 2.8800 2.7964 1.4989 5.2840 2.0310 1.5275 4.7198 7.6664 2.3303 2.1694 4.8045 11.8978 1.3366 13.8572 6.5563 15.0834 7.9800 8.1287 23.1017 31.1411 6.5393 17.9751 2.4344 10.9406 29.0790 22.8384 61.2057 0.2540 22.4254 58.7580 100.5474 26.6453 82.7811 22.4714 36.0509 4.3034 10.2694 20.0124 6.4768 11.4337 6.5628 4.1519 18.7338 2.5082 88.7331 22.7520 23.9738 30.9555 50.0697 17.9541 30.5264 32.7096 93.3788 47.0923 46.6088 3.3090 6.3920 19.5583 42.8264 21.4315 14.1625 3.3088 17.1007 29.4812 5.8228 2.0084 48.0652 70.9338 204.1498 349.9687 145.0004 353.8051 208.9042 13.3079 33.1892 13.9605 72.8918 8.1531 59.3676 58.4262 141.0822 8.5656 97.3455 9.9134 19.4716 40.9665 47.7862 30.1943 34.3753 77.2499 77.1352 43.2870 34.1857 253.2926 806.6216 9.9119 31.2464 147.8616 180.6932 185.5686 22.4191 8.5869 32.9138 27.1605 40.8935 1.3589 12.8427 10.2914 10.4638 17.6205 99.3073 6.8738 7.7051 5.2725 15.6290 7.5857 36.4099
temp: 298.150 k
press: 1.00000 atm
elementType: 17 16 9 8 8 8 8 8 8 7 7 7 6 6 6 6 6 6 6 6 6 6 6 6 6 6 6 6 6 1 1 1 1 1 1 1 1 1 1 1 1 1 1 1 1 1
symmnumber: 1
zpe: 859531.3 jmol-1
zpe.correction: 0.327378 hartree
zpe.thermalcorrener: 0.355730 hartree
zpe.thermalcorrenthalpy: 0.356674 hartree
zpe.thermalcorrgfe: 0.264590 hartree
zpe.sumelectzpe: -2229.206957 hartree
zpe.sumelectthermal: -2229.178605 hartree
zpe.sumelectthermalent: -2229.177661 hartree
zpe.sumelectthermalfe: -2229.269745 hartree
dipole: 0.5018 -14.6701 -2.4043
dipole: 14.8742
quadrupole: -261.9344 -182.0683 -186.2308
quadrupole: -7.4579 -17.9501 13.1579
quadrupole: -51.8566 28.0095 23.8471 -7.4579 -17.9501 13.1579
hfenergy: -2229.5343351 hartree
pointgroup: C01 [X(C17H17Cl1F1N3O6S1)]
dipole: -0.9652759 -5.7717324 0.031977 debye
polarizability: 398.5499991|14.2273483|318.1430693|20.366629|-36.8412361|165.1296279 unknown
InChI: InChI=1S/C17H17ClFN3O6S/c1-11-9-12(3-6-16(11)29(19,26)27)21-17(23)20-7-2-8-28-15-5-4-13(22(24)25)10-14(15)18/h3-6,9-10,20-21H,2,7-8H2,1H3
charge 0 multiplicity 1
46 atoms
Cl -7.182573 0.615171 0.463335
S  6.176894 0.461486 1.343004
F  6.563836 -0.343224 2.990032
O  -4.606867 -0.72755 0.891987
O  -0.556079 -0.91021 0.054747
O  7.431944 0.091928 0.407632
O  5.797123 1.992466 1.649935
O  -2.933767 4.727085 -2.018742
O  -5.205834 4.940825 -1.928677
N  -1.143778 -3.141818 -0.290918
N  1.10896 -2.586272 0.031718
N  -4.109381 4.295118 -1.693842
C  -3.418283 -2.876587 0.815494
C  -2.584287 -2.875365 -0.493121
C  -3.513084 -1.515754 1.52636
C  4.71747 -1.915952 0.735637
C  2.264498 -1.831908 0.341218
C  4.637567 -0.516756 0.949109
C  3.493984 -2.546696 0.426074
C  2.243477 -0.428622 0.570117
C  3.446587 0.227193 0.882445
C  -0.223279 -2.130046 -0.059146
C  5.999504 -2.71434 0.847698
C  -4.389875 0.492097 0.274163
C  -5.558538 1.260169 -0.014206
C  -3.12166 1.006424 -0.111585
C  -4.203865 2.989104 -1.018006
C  -5.480458 2.500101 -0.654388
C  -3.028665 2.252898 -0.754879
H  -2.992697 -3.620942 1.51668
H  -4.452047 -3.202047 0.593471
H  -2.964485 -3.654301 -1.177919
H  -2.684306 -1.906378 -1.012245
H  -2.557404 -0.96715 1.510873
H  -3.845583 -1.648331 2.570548
H  3.504332 -3.631152 0.25686
H  -0.845422 -4.118497 -0.289117
H  1.304737 0.120453 0.498196
H  3.45751 1.30549 1.070623
H  1.276408 -3.578125 -0.151406
H  6.761321 -2.351474 0.135562
H  6.436068 -2.610264 1.857465
H  5.813658 -3.782464 0.652951
H  -2.209536 0.425695 0.057217
H  -6.372826 3.091695 -0.871847
H  -2.061804 2.65793 -1.063404
