program: Gaussian 09
title: 000280414
version: EM64L-G09RevD.01
frameworkgroup: C1[X(C17H18N2O2S)]
method: RPBEPBE
basis: SDD
operation: Freq
keyword: #p
keyword: freq=noraman
keyword: PBEPBE/SDD
title: #p freq=noraman PBEPBE/SDD
converged: YES YES NO NO
title: Mulliken charges:
elementType: S O O N N C C C C C C C C C C C C C C C C C H H H H H H H H H H H H H H H H H H
charge: 0.956486 -0.543525 -0.513687 -0.027817 -0.499665 -0.420680 -0.557396 -0.527942 0.366980 0.140181 0.061321 -0.416995 -0.347790 -0.235711 -0.241629 -0.038369 -0.235845 -0.237590 0.453181 -0.361791 -0.364097 -0.799562 0.212486 0.221062 0.223635 0.226862 0.246588 0.233381 0.233527 0.271847 0.228025 0.229126 0.308985 0.284397 0.281247 0.243317 0.243164 0.230382 0.243043 0.230870
chargesum: 0.00000
title: Mulliken charges with hydrogens summed into heavy atoms:
elementType: S O O N N C C C C C C C C C C C C C C C C C
charge: 0.956486 -0.543525 -0.513687 -0.027817 -0.190681 0.012868 -0.106899 -0.047974 0.366980 0.140181 0.061321 -0.183467 -0.075943 -0.007686 -0.012503 -0.038369 0.048552 0.043657 0.453181 -0.118474 -0.120934 -0.095266
polarizability: 3.43821459e+02 1.84560297e+01 2.48320230e+02 -6.68169399e+00 -2.20113514e+01 1.71245763e+02
1716.lowfreq: -38.0196 -10.9970 -4.5193 -2.0980 -0.0020 -0.0020 -0.0019 7.6397 12.7841
frequency: -37.9530 4.4484 11.9979 28.5234 44.6963 53.6977 91.9617 105.1391 117.5909 127.2162 160.2727 162.5170 192.4273 223.4107 255.1604 284.8624 287.1958 318.6943 337.5921 359.3511 384.8631 392.5459 407.3856 409.4413 417.5429 438.4913 471.7918 482.0074 503.0604 515.9160 556.4420 583.9216 601.9703 607.4561 621.5555 684.8791 709.5817 737.7423 771.9006 775.6529 781.2267 803.4392 824.8248 830.4777 849.0552 856.1046 883.6093 892.7246 917.3427 948.2455 964.1691 965.3396 983.2792 990.0348 994.1550 997.0020 1007.9207 1034.3292 1042.3348 1049.2675 1054.6362 1059.7248 1100.3424 1118.0607 1122.9396 1144.6633 1171.9130 1183.5318 1192.4575 1206.9978 1217.4426 1246.4321 1270.0838 1279.4208 1296.3928 1324.7046 1331.2422 1342.5420 1359.5202 1382.4026 1383.3428 1392.3797 1398.7597 1441.6955 1449.7063 1459.7506 1471.2765 1472.2068 1473.5242 1473.6652 1482.2142 1540.2601 1580.3966 1595.7328 1596.5592 1613.7737 2937.5851 2956.8951 2980.7213 2992.1621 3009.8067 3036.2363 3057.5464 3063.2454 3092.3358 3117.8816 3133.8396 3136.3710 3138.0590 3152.9943 3164.0387 3167.3637 3168.8350 3220.3727
redmass: 1.0135 5.3945 4.0743 3.8810 3.6163 7.0789 4.2432 4.2299 5.1752 6.0911 4.2765 8.5954 4.1853 7.7146 3.4440 3.1137 4.5519 3.7069 3.6751 4.5298 4.7593 8.3219 2.9257 3.9144 3.4174 4.0091 5.4603 3.5327 3.2586 3.4714 3.2650 4.9802 3.4960 3.1632 6.9507 4.3065 3.2638 2.3832 1.5465 4.5415 3.5074 5.5444 1.9129 1.7459 1.2474 1.5642 1.5586 1.8754 2.4521 11.2639 1.3182 1.3830 1.3845 1.4293 5.4753 1.3460 4.6320 2.5714 2.5089 1.5983 2.4712 1.9460 2.2138 1.2864 1.7137 1.1639 1.0858 1.1403 1.4201 2.2976 3.0383 1.3687 1.3722 1.2269 1.2629 1.3668 2.2533 1.6450 1.6034 6.3108 7.0698 2.9814 1.2198 1.5813 1.5661 1.1328 1.1022 1.1027 1.1031 2.1753 2.3234 9.1336 6.8322 6.0717 6.9639 6.6588 1.0642 1.0664 1.0389 1.0670 1.0885 1.0930 1.1040 1.0948 1.1001 1.0869 1.0894 1.0893 1.0895 1.0950 1.0955 1.0966 1.0982 1.0739
irintensity: 0.4789 1.1137 0.6122 0.0961 1.1170 0.4531 0.8391 1.5148 3.8746 0.3146 0.7267 14.1375 1.0439 16.6239 8.6052 21.9570 0.7494 3.6669 2.7448 32.5755 3.5966 34.1669 5.2079 35.9355 37.8820 18.0089 32.8376 8.5726 16.0547 55.4007 1.0269 10.2717 79.8360 2.6161 0.1977 42.3472 1.4790 18.8586 50.6364 10.4169 89.0855 147.6329 68.7188 78.9336 0.9623 3.0268 3.9746 8.6855 14.8109 49.2417 0.9553 2.5924 0.0466 2.7241 4.1098 0.0961 0.5501 13.4413 5.9773 18.7224 32.7356 1.1309 1.0154 6.8634 2.3392 1.4802 3.5539 14.3362 0.1576 2.1574 6.2950 3.8320 7.0370 9.4140 2.4743 3.6817 34.9108 1.7360 7.4974 0.4014 0.4589 10.3460 16.1183 5.8360 11.9467 7.3240 15.6787 8.8822 18.2710 19.6416 9.8831 28.1183 2.8302 12.1327 0.5147 9.2951 16.3945 28.9136 24.4032 17.5017 31.0747 49.5044 43.6725 20.7765 14.4783 11.0554 12.8104 14.2769 7.9740 29.4978 1.5054 9.5309 18.1550 12.0850
temp: 298.150 k
press: 1.00000 atm
elementType: 16 8 8 7 7 6 6 6 6 6 6 6 6 6 6 6 6 6 6 6 6 6 1 1 1 1 1 1 1 1 1 1 1 1 1 1 1 1 1 1
symmnumber: 1
zpe: 817125.8 jmol-1
zpe.correction: 0.311227 hartree
zpe.thermalcorrener: 0.331619 hartree
zpe.thermalcorrenthalpy: 0.332563 hartree
zpe.thermalcorrgfe: 0.257715 hartree
zpe.sumelectzpe: -1314.843646 hartree
zpe.sumelectthermal: -1314.823254 hartree
zpe.sumelectthermalent: -1314.822310 hartree
zpe.sumelectthermalfe: -1314.897158 hartree
dipole: 1.3071 3.2307 4.5636
dipole: 5.7422
quadrupole: -110.5690 -132.1978 -143.2164
quadrupole: -19.7255 -7.4113 -10.9596
quadrupole: 18.0921 -3.5368 -14.5553 -19.7255 -7.4113 -10.9596
hfenergy: -1315.1548732 hartree
pointgroup: C01 [X(C17H18N2O2S1)]
dipole: -0.2911838 2.1937727 0.4542483 debye
polarizability: 343.5948625|-24.1383849|170.0080915|-8.4864227|11.8098415|249.7844981 unknown
InChI: InChI=1S/C17H18N2O2S/c1-13-9-11-15(12-10-13)22(20,21)19-18-17-8-4-6-14-5-2-3-7-16(14)17/h2-3,5,7,9-12,19H,4,6,8H2,1H3
charge 0 multiplicity 1
40 atoms
S  1.88726 -1.732295 -1.150043
O  2.62801 -2.094494 -2.556407
O  1.226465 -2.869736 -0.193329
N  -0.41633 -0.218329 -0.810297
N  0.554712 -0.412995 -1.754972
C  -3.055182 1.785859 -2.61927
C  -4.272309 1.308822 -1.800479
C  -1.918357 0.741953 -2.559131
C  -3.885764 1.001581 -0.360289
C  -2.573793 0.527793 -0.049084
C  -1.583517 0.324007 -1.131931
C  -4.823097 1.166256 0.687691
C  -2.242663 0.224654 1.302418
C  -4.487648 0.863148 2.024195
C  -3.187689 0.387965 2.330154
C  3.007779 -0.661338 -0.096185
C  2.813061 -0.67019 1.293419
C  4.011098 0.081894 -0.737138
C  4.704198 0.903593 1.484349
C  3.677489 0.123169 2.079183
C  4.862289 0.864563 0.072801
C  5.605131 1.775787 2.339156
H  -3.341613 1.962261 -3.672614
H  -2.690414 2.747383 -2.209862
H  -4.692092 0.396668 -2.27582
H  -5.075633 2.068354 -1.821231
H  -1.005107 1.143147 -3.042503
H  -2.217031 -0.158513 -3.141101
H  -5.827761 1.536322 0.448721
H  -1.235557 -0.145313 1.516116
H  -5.227956 0.997619 2.820749
H  -2.919086 0.148142 3.364852
H  0.27832 -0.7843 -2.693379
H  2.02916 -1.291182 1.737958
H  4.133436 0.031048 -1.823652
H  3.55299 0.134282 3.168016
H  5.660245 1.450278 -0.397682
H  6.599482 1.907478 1.878711
H  5.166124 2.78409 2.468318
H  5.74655 1.348568 3.346993
