program: Gaussian 09
title: 000025188
version: EM64L-G09RevD.01
frameworkgroup: C1[X(C3H3O2)]
method: RPBEPBE
basis: SDD
operation: Freq
keyword: #p
keyword: freq=noraman
keyword: PBEPBE/SDD
title: #p freq=noraman PBEPBE/SDD
converged: YES YES NO YES
title: Mulliken charges:
elementType: O O C C C H H H
charge: -0.437995 -0.423854 -0.214479 0.067630 -0.579361 0.192657 0.162266 0.233135
chargesum: -1.00000
title: Mulliken charges with hydrogens summed into heavy atoms:
elementType: O O C C C
charge: -0.437995 -0.423854 -0.021822 0.067630 -0.183960
polarizability: 5.84623326e+01 -6.90537674e+00 4.32683234e+01 2.27459347e-04 -2.01590790e-03 1.82232144e+01
1716.lowfreq: -0.0005 0.0006 0.0013 4.9718 9.2797 15.7825 106.5783 259.6509 489.8291
frequency: 106.5472 259.6507 489.8290 501.5853 599.8459 787.4541 805.7745 911.6268 1011.8497 1016.4571 1211.1387 1254.4930 1365.0682 1523.3212 1610.4801 3037.7377 3077.8681 3163.7973
redmass: 2.8192 3.5552 5.4818 1.5907 4.2058 3.1498 4.8945 1.4679 1.0844 1.4624 3.1453 1.8778 1.2351 10.8609 4.8873 1.0584 1.0926 1.1129
irintensity: 2.1813 0.8365 7.4310 0.0352 7.2766 23.9249 35.5461 53.8646 40.3873 9.4156 102.1989 44.6025 29.1146 289.7572 8.3947 42.5576 57.8092 37.2495
temp: 298.150 k
press: 1.00000 atm
elementType: 8 8 6 6 6 1 1 1
symmnumber: 1
zpe: 135982.7 jmol-1
zpe.correction: 0.051793 hartree
zpe.thermalcorrener: 0.056761 hartree
zpe.thermalcorrenthalpy: 0.057706 hartree
zpe.thermalcorrgfe: 0.023687 hartree
zpe.sumelectzpe: -266.220100 hartree
zpe.sumelectthermal: -266.215131 hartree
zpe.sumelectthermalent: -266.214187 hartree
zpe.sumelectthermalfe: -266.248206 hartree
dipole: -4.8277 -1.5511 -0.0004
dipole: 5.0708
quadrupole: -41.9330 -37.9040 -32.2069
quadrupole: 1.0675 -0.0010 -0.0025
quadrupole: -4.5851 -0.5560 5.1411 1.0675 -0.0010 -0.0025
hfenergy: -266.2718929 hartree
pointgroup: C01 [X(C3H3O2)]
dipole: 1.9076664 0.5838067 -0.0001723 debye
dipolederiv: -1.0433901 0.3849258 -0.0001404 0.1055864 -0.9436909 0.0001182 0.0000587 -0.0001413 -0.5133761 -0.7349113 -0.101136 -0.0000254 -0.0669785 -1.2466014 -0.0000615 0.0000032 0.0003615 -0.4921302 -0.0946301 -0.1043147 0.0000167 -0.1170752 0.1152166 0.0001834 -0.0001049 0.0001662 -0.1140843 1.1713349 -0.1625138 0.0001135 0.1309133 1.3687396 -0.0001066 0.000206 -0.0001787 0.1009662 -0.2110167 0.1133604 0.0001645 0.0988039 0.0036579 0.0002659 0.0000684 0.0002173 -0.5055749 0.0341404 -0.0226754 -0.0000028 -0.0814668 -0.224938 -0.0001595 -0.0000918 -0.0002017 0.1542854 -0.2415973 -0.1075724 -0.0001029 -0.1371511 0.0204038 -0.0000987 -0.0001019 -0.0000986 0.1688119 0.1200701 -0.0000739 -0.0000234 0.0673679 -0.0927876 -0.0001412 -0.0000375 -0.0001248 0.2011019 unknown
polarizability: 58.2676643|-7.1136575|43.4629916|-0.0001994|0.0020189|18.2232144 unknown
InChI: InChI=1S/C3H3O2/c1-2-3(4)5/h2H,1H2
charge -1 multiplicity 1
8 atoms
O  -1.581763 0.802061 0.000047
O  -0.610388 -1.340269 0.000267
C  0.806036 0.635974 0.000068
C  -0.580009 -0.038932 -0.00031
C  1.980487 -0.050721 -0.00003
H  0.787289 1.738795 0.000602
H  2.964918 0.441105 0.000365
H  1.93583 -1.148211 -0.000509
