program: Gaussian 09
title: 000280362
version: EM64L-G09RevD.01
frameworkgroup: C1[X(C9H18N2O)]
method: RPBEPBE
basis: SDD
operation: Freq
keyword: #p
keyword: freq=noraman
keyword: PBEPBE/SDD
title: #p freq=noraman PBEPBE/SDD
converged: YES YES NO NO
title: Mulliken charges:
elementType: O N N C C C C C C C C C H H H H H H H H H H H H H H H H H H
charge: -0.317690 -0.431832 -0.422054 -0.056763 -0.426954 -0.512230 -0.439371 -0.439221 0.306801 -0.022663 -0.668931 -0.705574 0.269712 0.198999 0.256285 0.225262 0.220881 0.215974 0.217221 0.209422 0.223066 0.282480 0.247188 0.270795 0.207091 0.191080 0.252473 0.232402 0.220363 0.195788
chargesum: 0.00000
title: Mulliken charges with hydrogens summed into heavy atoms:
elementType: O N N C C C C C C C C C
charge: -0.317690 -0.149352 -0.151260 0.212949 0.028330 -0.066087 -0.006175 -0.006734 0.306801 0.224524 -0.018287 -0.057021
polarizability: 1.42118998e+02 -1.42941431e+00 1.00868233e+02 -1.80908923e+00 -4.45698201e+00 9.77971614e+01
1716.lowfreq: -8.6709 0.0007 0.0008 0.0008 6.7983 19.6483 27.6672 41.7303 50.2376
frequency: 27.4605 40.8974 49.7596 62.6964 85.7318 98.3943 169.7020 215.3079 231.4452 252.9499 261.3591 272.6126 346.0839 390.4994 407.4090 439.2350 482.7932 491.1466 624.5562 670.7343 713.7569 722.5377 788.5540 808.5746 832.9985 879.0534 886.2475 897.9781 915.7333 921.6443 939.8392 952.5898 998.5250 1019.0050 1061.2111 1080.8564 1083.2183 1140.9866 1144.5540 1154.6348 1177.5560 1188.0006 1206.5227 1222.9857 1228.4618 1258.7815 1284.9862 1290.8638 1305.6845 1312.6919 1318.4644 1343.4762 1359.5644 1372.6733 1390.3322 1442.3578 1461.9050 1463.2937 1467.7641 1472.5805 1473.6139 1478.1100 1485.4890 1489.3590 1497.7837 1618.1660 2970.6745 2975.2092 2990.3504 2997.8875 3003.6643 3013.1179 3029.7847 3041.9832 3051.0096 3063.2103 3063.8108 3075.7274 3076.6619 3090.1010 3090.3123 3094.8314 3532.3469 3545.2174
redmass: 2.7351 3.1757 1.8417 5.5043 3.3123 3.0673 2.7709 1.1111 2.3577 1.7262 1.2986 1.4536 2.3784 2.6821 3.1916 2.3999 1.3209 2.5268 2.7949 2.6484 7.7547 3.1049 1.6411 1.9048 2.5241 3.6770 2.1586 2.0479 1.3664 1.8075 1.5301 1.9466 1.9244 1.6239 2.6802 1.8039 1.4994 2.1548 1.7440 1.8935 1.5244 1.7981 1.5396 1.5380 1.5920 1.4233 1.3075 1.2393 1.4173 1.4983 1.5546 1.2557 1.2974 1.2215 1.2311 1.4855 1.0801 1.0756 1.0466 1.1107 1.0928 1.1652 1.0838 1.3177 1.4536 5.3308 1.0379 1.0368 1.0609 1.0657 1.0610 1.0657 1.0851 1.1002 1.0882 1.0977 1.1028 1.0975 1.1013 1.1007 1.1004 1.0997 1.0772 1.0771
irintensity: 0.0277 1.2349 0.3175 17.8941 0.2374 0.6043 1.8160 0.8126 12.4581 5.2780 2.8075 6.9850 0.6293 8.5226 7.0027 1.8861 195.3088 0.2213 2.7834 5.7872 7.4097 4.9556 1.5847 4.1440 2.5016 2.4362 3.0120 8.4763 2.9876 2.6206 0.9949 3.1633 2.2270 3.1259 0.0681 12.2209 1.8368 25.2745 0.5192 10.5831 14.7372 50.0387 50.6784 105.7929 10.3188 48.4933 2.4365 7.8097 8.0346 17.5338 2.9578 1.4603 5.4500 26.1673 31.5542 43.4534 12.9138 3.0063 3.8943 61.9540 27.9285 100.4291 33.1473 251.2147 245.3992 171.7668 25.4504 36.3874 20.1708 34.1046 65.4285 30.1109 0.4382 13.2435 17.7657 6.4424 4.0774 76.0875 71.7551 62.3406 30.8975 32.1223 9.7891 7.8745
temp: 298.150 k
press: 1.00000 atm
elementType: 8 7 7 6 6 6 6 6 6 6 6 6 1 1 1 1 1 1 1 1 1 1 1 1 1 1 1 1 1 1
symmnumber: 1
zpe: 693120.2 jmol-1
zpe.correction: 0.263996 hartree
zpe.thermalcorrener: 0.278036 hartree
zpe.thermalcorrenthalpy: 0.278980 hartree
zpe.thermalcorrgfe: 0.221562 hartree
zpe.sumelectzpe: -537.534109 hartree
zpe.sumelectthermal: -537.520069 hartree
zpe.sumelectthermalent: -537.519125 hartree
zpe.sumelectthermalfe: -537.576543 hartree
dipole: 0.5214 2.8504 -2.8194
dipole: 4.0429
quadrupole: -65.7246 -76.7946 -75.2399
quadrupole: -4.0298 1.3287 0.4932
quadrupole: 6.8618 -4.2083 -2.6535 -4.0298 1.3287 0.4932
hfenergy: -537.7981049 hartree
pointgroup: C01 [X(C9H18N2O1)]
dipole: 0.2060375 -0.9952725 -1.2235377 debye
polarizability: 141.8553034|-3.4554935|97.0920834|2.4078666|3.924554|101.8370052 unknown
InChI: InChI=1S/C9H18N2O/c1-7(2)10-9(12)11-8-5-3-4-6-8/h7-8,10-11H,3-6H2,1-2H3
charge 0 multiplicity 1
30 atoms
O  -0.805753 0.852153 1.26485
N  0.52924 -0.558667 -0.037623
N  -1.751792 -0.268767 -0.562703
C  1.745116 -0.296313 0.760325
C  2.423127 1.049973 0.385081
C  2.843874 -1.33266 0.416077
C  3.189548 0.743725 -0.932196
C  3.55466 -0.781077 -0.863962
C  -0.683243 0.054458 0.27919
C  -3.109094 0.262448 -0.312067
C  -3.880406 -0.608024 0.709992
C  -3.864892 0.396798 -1.649487
H  1.451598 -0.314381 1.823846
H  3.129528 1.327116 1.191899
H  1.684063 1.86251 0.293261
H  2.437963 -2.352636 0.286244
H  3.559054 -1.371649 1.257418
H  4.08481 1.380231 -1.044757
H  2.539762 0.945192 -1.80383
H  3.211236 -1.307879 -1.774293
H  4.64649 -0.936814 -0.805274
H  0.622324 -1.113481 -0.889613
H  -2.959828 1.262299 0.134193
H  -1.656538 -1.016893 -1.252285
H  -4.867116 -0.162629 0.936464
H  -4.04563 -1.629373 0.316423
H  -3.307865 -0.67802 1.650652
H  -3.317973 1.053143 -2.349349
H  -4.868495 0.825782 -1.480927
H  -4.00387 -0.591464 -2.131648
