program: Gaussian 09
title: 000280437
version: EM64L-G09RevD.01
frameworkgroup: C1[X(C14H17N3O9)]
method: RPBEPBE
basis: SDD
operation: Freq
keyword: #p
keyword: freq=noraman
keyword: PBEPBE/SDD
title: #p freq=noraman PBEPBE/SDD
converged: YES YES NO NO
title: Mulliken charges:
elementType: O O O O O O O O O N N N C C C C C C C C C C C C C C H H H H H H H H H H H H H H H H H
charge: -0.277653 -0.257759 -0.247010 -0.256075 -0.245203 -0.270729 -0.261149 -0.187510 -0.161959 -0.200330 -0.044759 0.064029 -0.065626 -0.036571 -0.501084 -0.046083 -0.355412 0.155092 -0.198880 0.077157 0.300536 0.221227 0.328527 -0.754928 -0.751649 -0.494106 0.264546 0.248792 0.264728 0.273862 0.286377 0.236768 0.285027 0.353156 0.256811 0.251950 0.252888 0.250895 0.255373 0.250933 0.248847 0.244149 0.242806
chargesum: 0.00000
title: Mulliken charges with hydrogens summed into heavy atoms:
elementType: O O O O O O O O O N N N C C C C C C C C C C C C C C
charge: -0.277653 -0.257759 -0.247010 -0.256075 -0.245203 -0.270729 -0.261149 -0.187510 -0.161959 -0.200330 -0.044759 0.064029 0.198921 0.212220 0.037506 0.240294 0.166383 0.155092 0.154276 0.077157 0.300536 0.221227 0.328527 0.006721 0.005552 0.241696
polarizability: 2.49576955e+02 -1.14744663e+00 2.17204564e+02 -6.14469916e+00 1.45568434e+01 1.54338514e+02
1716.lowfreq: -9.0954 -6.2333 -2.9187 -0.0008 -0.0004 0.0001 15.7184 19.6795 34.7865
frequency: 15.0056 19.5882 34.7129 36.4227 47.9129 53.0240 57.1982 62.0926 65.5691 69.0051 79.0127 80.3771 92.0721 99.6886 106.2706 122.1088 138.2094 150.0090 179.7368 200.0184 211.7553 236.9522 242.2174 251.6476 280.7510 297.8144 321.7080 336.6642 374.0951 387.4036 398.4589 436.7727 468.6723 477.4607 505.7857 547.5772 566.8642 569.5244 578.7504 616.4746 622.8155 641.1056 661.3421 681.6169 707.6308 740.6532 747.7482 755.8179 762.8314 782.4464 807.6946 834.2990 900.7887 907.0348 911.5416 930.3585 950.6587 973.8936 984.3150 1003.8768 1009.3905 1015.3237 1039.7967 1043.9918 1045.7901 1060.4635 1078.2364 1095.4165 1113.6551 1116.0695 1151.9223 1168.1452 1185.5735 1195.4458 1202.2233 1203.4448 1226.6158 1240.2495 1248.5687 1263.1411 1280.9318 1286.2450 1299.1520 1303.2026 1326.8402 1334.5953 1353.6610 1372.9837 1379.3859 1386.7909 1387.9447 1388.2269 1416.6126 1425.9356 1452.2800 1452.5000 1453.4373 1454.2415 1454.2682 1455.4003 1457.5536 1460.3970 1497.0061 1606.5546 1652.1180 1655.8061 3007.6668 3008.6896 3008.8895 3019.2311 3037.5679 3042.2236 3054.2282 3087.4239 3100.0645 3101.5379 3112.4024 3122.8753 3136.5041 3144.4415 3145.2135 3160.4710 3194.6491
redmass: 7.5388 5.6336 3.6204 1.4325 4.2426 5.4482 3.9819 3.6006 2.9762 1.4007 1.4509 3.8336 3.1035 4.7108 6.5646 5.4046 7.1617 5.3803 4.6967 6.1132 6.5929 7.7686 6.2655 7.5016 4.0897 5.1351 5.2751 5.4736 4.8780 3.1955 5.2219 4.3050 4.3650 5.7213 2.9984 4.2448 3.3423 5.3077 4.0391 4.4860 5.8706 4.4453 6.3873 6.6684 10.5551 6.2055 8.7501 10.4630 7.8564 4.3524 3.8933 5.5294 2.4543 1.3508 5.8770 3.9774 4.2359 4.9520 2.2565 2.2032 3.2557 2.5853 2.9115 1.6694 1.7429 3.8693 4.6778 4.1349 1.2611 2.1794 1.4630 1.7271 2.2533 2.5873 5.0248 3.6206 2.0517 1.4116 1.2115 2.0115 1.6157 4.3038 1.6793 2.1420 5.3894 1.2996 1.3022 1.4119 1.7178 1.2756 6.7299 1.3345 1.6691 1.7164 1.0572 1.0799 1.0690 1.0537 1.0507 1.0588 1.0941 1.0539 7.3922 10.0709 9.7815 9.1655 1.0388 1.0382 1.0297 1.0849 1.0690 1.0779 1.0650 1.0883 1.0939 1.0947 1.1049 1.1046 1.1013 1.1023 1.1022 1.1048 1.1050
irintensity: 0.8195 0.9181 0.6056 1.6034 0.8472 0.5609 2.0381 0.2554 1.8429 0.5415 0.8318 0.7845 0.7591 4.2001 7.1176 1.5864 2.2826 6.2901 1.9034 5.3302 0.7450 2.9824 6.8798 1.4871 10.2097 22.5085 5.6567 3.1421 14.8591 4.3469 0.0689 5.6758 6.9624 4.0002 10.7020 13.4535 1.5828 7.9222 10.7553 5.9627 14.3273 5.2167 0.8298 0.0406 8.4239 22.3161 44.0342 1.3440 4.5304 8.8242 11.0686 10.7085 45.0262 13.6733 11.2974 51.6583 52.7391 57.9047 15.4160 130.5901 127.3856 1.8365 20.2630 12.9154 12.1029 169.2018 46.8400 28.4608 0.0492 0.4049 30.5440 51.8684 430.8887 237.5966 222.8776 47.2391 69.8855 12.1429 22.8371 37.5691 24.7100 15.9252 7.7096 1.0655 172.3430 10.8611 7.1096 3.4521 41.9145 39.5829 113.6324 112.5583 7.5124 42.1541 28.3876 27.9122 22.2150 22.1690 14.7449 9.3279 14.9049 14.7594 125.8156 233.1129 216.4163 194.7266 0.6776 1.1687 31.4412 16.6133 5.9524 18.7514 3.7273 9.1092 5.7126 8.3760 21.4009 3.5728 6.6138 6.3196 6.4500 9.2913 190.5713
temp: 298.150 k
press: 1.00000 atm
elementType: 8 8 8 8 8 8 8 8 8 7 7 7 6 6 6 6 6 6 6 6 6 6 6 6 6 6 1 1 1 1 1 1 1 1 1 1 1 1 1 1 1 1 1
symmnumber: 1
zpe: 827250.4 jmol-1
zpe.correction: 0.315083 hartree
zpe.thermalcorrener: 0.342015 hartree
zpe.thermalcorrenthalpy: 0.342959 hartree
zpe.thermalcorrgfe: 0.252735 hartree
zpe.sumelectzpe: -1382.900740 hartree
zpe.sumelectthermal: -1382.873808 hartree
zpe.sumelectthermalent: -1382.872863 hartree
zpe.sumelectthermalfe: -1382.963087 hartree
dipole: 6.0417 -5.5880 -4.8179
dipole: 9.5363
quadrupole: -150.2050 -140.8914 -156.5301
quadrupole: 13.3255 11.7940 -8.5511
quadrupole: -0.9962 8.3174 -7.3212 13.3255 11.7940 -8.5511
hfenergy: -1383.2158228 hartree
pointgroup: C01 [X(C14H17N3O9)]
dipole: -2.0250381 2.243888 -2.2227442 debye
polarizability: 244.7946312|0.9057726|217.8054321|21.7252243|-13.2475893|158.5199703 unknown
InChI: InChI=1S/C14H17N3O9/c1-7(18)24-5-10-9(25-8(2)19)4-11(26-10)16-6-15-13(17(21)22)12(16)14(20)23-3/h6,9-11H,4-5H2,1-3H3
charge 0 multiplicity 1
43 atoms
O  -1.194193 -0.418023 -1.216243
O  -2.830864 2.658572 -0.160033
O  -3.679439 -1.900431 -0.783052
O  4.190531 1.174771 0.222685
O  -4.358822 1.927528 1.446151
O  2.37418 2.038627 -0.965242
O  -1.998583 -3.253348 0.113116
O  3.989434 0.132261 2.964751
O  4.366732 -2.002153 2.234168
N  0.813689 -0.273967 0.092943
N  1.477633 -1.787897 1.649315
N  3.693252 -0.907637 2.262898
C  -1.978961 1.469398 0.098211
C  -2.44574 0.230377 -0.714546
C  -0.578448 1.783408 -0.457564
C  -0.035574 0.421117 -0.937796
C  -3.261251 -0.780254 0.095325
C  2.115504 0.109934 0.485774
C  0.4806 -1.418435 0.804526
C  2.468106 -0.850886 1.456062
C  -3.995063 2.795312 0.62255
C  2.860021 1.198967 -0.155675
C  -2.935578 -3.088001 -0.698994
C  -4.67619 4.109606 0.328683
C  -3.425945 -4.091158 -1.714539
C  5.045572 2.259881 -0.31517
H  -1.982567 1.258968 1.183161
H  -3.019199 0.56053 -1.601723
H  -0.680512 2.455122 -1.326171
H  0.08259 2.27246 0.270167
H  0.57408 0.511635 -1.849155
H  -2.683677 -1.173963 0.949817
H  -4.191047 -0.312952 0.453316
H  -0.443236 -1.975913 0.651325
H  -4.176656 4.916012 0.89648
H  -5.728506 4.061265 0.644528
H  -4.602388 4.361238 -0.740909
H  -4.523687 -4.060549 -1.79863
H  -3.005791 -3.838738 -2.70525
H  -3.086645 -5.098767 -1.433973
H  6.026959 2.088179 0.146219
H  4.636147 3.242979 -0.029569
H  5.10093 2.188624 -1.414235
