program: Gaussian 09
title: 000280392
version: EM64L-G09RevD.01
frameworkgroup: C1[X(C16H22N2O2S)]
method: RPBEPBE
basis: SDD
operation: Freq
keyword: #p
keyword: freq=noraman
keyword: PBEPBE/SDD
title: #p freq=noraman PBEPBE/SDD
converged: YES YES NO NO
title: Mulliken charges:
elementType: S O O N N C C C C C C C C C C C C C C C C H H H H H H H H H H H H H H H H H H H H H H
charge: 0.958598 -0.517339 -0.542037 0.013707 -0.505682 -0.121558 -0.155534 -0.467288 -0.443647 -0.434391 0.064375 -0.546641 -0.379402 -0.404968 -0.034922 -0.241035 -0.231428 -0.364061 -0.367438 0.452843 -0.800291 0.234261 0.229356 0.220571 0.219985 0.205225 0.203904 0.194740 0.222738 0.232004 0.252615 0.197158 0.185773 0.196003 0.215523 0.302721 0.282112 0.285606 0.242609 0.242589 0.230592 0.241709 0.230346
chargesum: 0.00000
title: Mulliken charges with hydrogens summed into heavy atoms:
elementType: S O O N N C C C C C C C C C C C C C C C C
charge: 0.958598 -0.517339 -0.542037 0.013707 -0.202961 0.112703 0.073822 -0.026733 -0.034518 -0.016914 0.064375 -0.062022 0.003529 0.006558 -0.034922 0.041076 0.054178 -0.121452 -0.124849 0.452843 -0.097644
polarizability: 2.58756376e+02 -1.53853818e+01 2.26186024e+02 9.18843564e+00 9.26784464e+00 1.81302122e+02
1716.lowfreq: -26.7832 -4.1471 -0.0016 -0.0016 -0.0014 4.1042 7.9345 17.2743 26.6025
frequency: -26.3772 17.0631 25.8488 32.4758 56.1781 64.8518 94.5150 112.2375 128.7144 136.3976 171.5563 185.4758 197.4089 223.8851 246.2506 279.8238 288.9920 304.2773 329.4465 342.1114 364.2629 388.1393 396.8310 405.2562 409.3705 424.1778 452.4805 484.5971 508.7128 533.5807 564.2051 585.0787 621.5106 622.5971 681.5660 709.1565 711.3039 773.0030 775.9177 799.4326 807.7109 825.9841 831.2997 848.2566 850.6838 864.4158 898.5347 907.0040 926.4966 948.0967 962.2659 966.1776 982.3502 990.0778 991.7456 994.7690 1005.9850 1041.0684 1048.7707 1052.4850 1055.6869 1059.2616 1065.2230 1109.9396 1110.6709 1118.6898 1141.2782 1170.0423 1184.3405 1195.2271 1207.5025 1217.2020 1231.3427 1248.8410 1259.7707 1276.6628 1289.5122 1295.3653 1297.2894 1304.4430 1314.5311 1326.8159 1335.9937 1344.6002 1354.5553 1358.0115 1382.5941 1392.3403 1398.5973 1448.9678 1457.9207 1463.1362 1465.7631 1470.7020 1472.9911 1474.3596 1474.9360 1474.9941 1596.0238 1597.1376 1615.0330 2926.3737 2963.7497 2965.3213 2967.3137 2979.0081 2980.4608 2981.1009 2993.0691 3006.7601 3012.9699 3028.0585 3031.6182 3039.9533 3050.0671 3063.0458 3064.7610 3092.6750 3135.8789 3137.6355 3163.6261 3169.1489 3226.4653
redmass: 1.0268 4.2701 4.0765 3.7636 4.0311 5.9424 5.0242 3.8901 5.4574 4.0083 3.0651 7.2084 2.4983 7.9559 3.4544 3.7799 4.3979 2.4515 2.9764 2.0010 3.4399 3.9254 8.3996 4.4845 3.0915 4.3370 2.8933 2.4731 2.9514 2.8177 4.2696 5.2929 4.9821 3.3968 2.7437 3.0460 2.7300 2.2244 4.7113 1.8401 4.8834 1.5561 1.9735 1.2484 2.5072 1.9125 1.8823 1.8169 2.3334 11.7316 1.4410 1.9669 1.3893 1.4283 2.0105 4.8312 3.3637 1.9363 1.5939 1.9301 2.4527 1.4571 1.4582 1.1319 1.5601 1.2862 1.9312 1.4437 1.1403 1.7140 1.7911 3.0326 1.3799 1.5182 1.3527 1.3666 1.4075 1.2068 1.2607 1.4931 1.3774 1.8233 1.4056 1.4869 1.4624 1.4868 6.6555 2.8879 1.2210 1.0789 1.0852 1.0908 1.0848 1.1043 1.0905 2.1882 1.0826 1.1061 6.0394 7.0113 11.5035 1.0805 1.0627 1.0603 1.0612 1.0607 1.0391 1.0664 1.0721 1.0861 1.0919 1.0954 1.0997 1.0991 1.1019 1.0947 1.1035 1.1001 1.0895 1.0895 1.0958 1.0961 1.0739
irintensity: 0.6116 0.9639 0.9743 0.2768 0.5417 0.6639 1.3548 0.9578 0.0773 3.0061 3.0598 0.4314 2.3431 15.4492 2.9784 14.3849 3.1882 1.5464 7.4212 0.1952 13.8905 4.3194 26.0935 9.7603 3.4736 70.0740 1.6277 0.2015 73.1110 13.7068 19.9557 16.9623 10.2473 28.4917 17.5952 1.8177 15.4252 0.7346 6.5180 16.0303 120.9133 33.1026 55.4238 0.1497 24.0868 17.9891 1.6304 9.9228 5.7591 60.3646 1.8151 1.2833 0.1426 3.0481 2.7613 5.8433 4.8177 5.8852 17.6128 1.1471 25.3452 0.7213 0.6135 0.6412 0.2019 6.9935 1.8212 2.7880 11.0308 5.4553 4.3349 5.3367 1.7738 3.5389 0.5537 0.8926 2.0568 20.5839 2.1658 1.5540 0.6339 2.1590 0.1923 0.3444 3.7935 1.0527 0.6018 10.1056 16.4133 9.1254 6.3149 9.2430 16.7737 17.2297 4.7541 19.3846 11.6717 14.5256 11.9907 0.1862 44.5478 21.7132 41.5736 8.1092 29.4215 34.1071 23.3359 24.3437 31.5246 26.2726 35.0822 66.8862 73.1237 49.7141 75.5646 20.6453 38.6904 14.7422 14.7099 7.6629 3.2365 6.0950 12.6999
temp: 298.150 k
press: 1.00000 atm
elementType: 16 8 8 7 7 6 6 6 6 6 6 6 6 6 6 6 6 6 6 6 6 1 1 1 1 1 1 1 1 1 1 1 1 1 1 1 1 1 1 1 1 1 1
symmnumber: 1
zpe: 922501.6 jmol-1
zpe.correction: 0.351362 hartree
zpe.thermalcorrener: 0.371613 hartree
zpe.thermalcorrenthalpy: 0.372558 hartree
zpe.thermalcorrgfe: 0.300697 hartree
zpe.sumelectzpe: -1279.131269 hartree
zpe.sumelectthermal: -1279.111017 hartree
zpe.sumelectthermalent: -1279.110073 hartree
zpe.sumelectthermalfe: -1279.181934 hartree
dipole: 2.6490 5.3310 -1.8597
dipole: 6.2366
quadrupole: -117.1387 -139.4195 -133.8138
quadrupole: -23.1782 3.5739 5.3818
quadrupole: 12.9853 -9.2955 -3.6898 -23.1782 3.5739 5.3818
hfenergy: -1279.4826308 hartree
pointgroup: C01 [X(C16H22N2O2S1)]
dipole: -1.1236472 2.0608159 0.7147723 debye
polarizability: 257.5740137|16.7615669|227.3077204|8.4389854|-9.7348154|181.3627886 unknown
InChI: InChI=1S/C16H22N2O2S/c1-12-6-9-14(10-7-12)21(19,20)18-17-16-11-8-13-4-2-3-5-15(13)16/h6-7,9-10,13,15,18H,2-5,8,11H2,1H3
charge 0 multiplicity 1
43 atoms
S  1.758113 -2.107906 -0.226563
O  1.619319 -2.440644 -1.813387
O  2.426912 -3.164558 0.816265
N  -0.765464 -1.009937 -0.249543
N  0.040064 -1.762472 0.600153
C  -4.206711 0.091138 0.079813
C  -2.998448 -0.126302 -0.886828
C  -4.318671 -1.282295 0.806348
C  -3.944527 1.251698 1.075862
C  -2.383464 1.157213 -1.487917
C  -2.060572 -0.990738 -0.047216
C  -2.843788 -1.725708 1.038246
C  -3.463491 2.537806 0.364869
C  -2.16468 2.262157 -0.428953
C  2.567057 -0.426519 -0.046368
C  3.22506 -0.133188 1.157974
C  2.507299 0.455181 -1.13599
C  3.854263 1.125938 1.268718
C  3.143493 1.708338 -0.99734
C  3.816279 2.06358 0.20194
C  4.469331 3.425973 0.34739
H  -5.123755 0.317732 -0.49769
H  -3.352987 -0.766663 -1.726411
H  -4.834281 -2.014256 0.156338
H  -4.888535 -1.214065 1.750067
H  -3.166317 0.944493 1.805189
H  -4.866595 1.446197 1.658106
H  -3.064728 1.540371 -2.274436
H  -1.426463 0.898861 -1.977751
H  -2.71567 -2.826292 0.981748
H  -2.469548 -1.420303 2.036226
H  -3.298151 3.341721 1.108108
H  -4.251655 2.898048 -0.329128
H  -1.811997 3.186571 -0.925781
H  -1.365513 1.948951 0.272004
H  -0.303532 -2.709008 0.884981
H  3.260351 -0.870806 1.965994
H  1.9983 0.159762 -2.058404
H  4.383388 1.381484 2.193881
H  3.117753 2.417913 -1.832301
H  4.820246 3.813904 -0.624522
H  3.751211 4.163319 0.755764
H  5.331502 3.392114 1.035645
