program: Gaussian 09
title: 000280406
version: EM64L-G09RevD.01
frameworkgroup: C1[X(C20H16N2O2S)]
method: RPBEPBE
basis: SDD
operation: Freq
keyword: #p
keyword: freq=noraman
keyword: PBEPBE/SDD
title: #p freq=noraman PBEPBE/SDD
converged: YES YES NO NO
title: Mulliken charges:
elementType: S O O N N C C C C C C C C C C C C C C C C C C C C H H H H H H H H H H H H H H H H
charge: 0.961699 -0.538965 -0.506131 0.080757 -0.491951 0.224255 0.227652 0.262521 0.216386 -0.325503 -0.398967 -0.403323 -0.428328 -0.366248 -0.233422 -0.227957 -0.230940 -0.259659 -0.040633 -0.233842 -0.238077 0.453112 -0.362709 -0.358645 -0.798455 0.246570 0.250729 0.276007 0.239996 0.228017 0.231515 0.230658 0.233590 0.317272 0.285146 0.281541 0.244888 0.244463 0.231286 0.244422 0.231274
chargesum: 0.00000
title: Mulliken charges with hydrogens summed into heavy atoms:
elementType: S O O N N C C C C C C C C C C C C C C C C C C C C
charge: 0.961699 -0.538965 -0.506131 0.080757 -0.174680 0.224255 0.227652 0.262521 0.216386 -0.325503 -0.152397 -0.152594 -0.152320 -0.126252 -0.005405 0.003558 -0.000283 -0.026069 -0.040633 0.051304 0.043464 0.453112 -0.117821 -0.114182 -0.091474
polarizability: 4.15498933e+02 -8.94418951e+00 3.24743059e+02 1.38690612e+01 2.23032090e+01 1.75735193e+02
1716.lowfreq: -9.9388 -4.0377 -2.9807 -0.0019 -0.0014 0.0010 7.1860 16.9908 30.5636
frequency: 4.8169 16.9288 30.5573 40.1196 51.2523 55.1463 94.6956 102.2594 117.5512 128.7218 138.8820 154.4092 190.8387 213.1114 224.6971 249.7708 275.3096 285.0634 316.5295 341.8844 375.3062 386.4965 398.8983 407.5727 409.0178 416.5333 434.0549 455.6047 478.2694 510.1420 513.0719 551.8312 571.3588 585.3652 615.6715 620.8355 638.2615 646.5855 697.1278 708.5489 742.8317 750.0050 760.4215 775.7736 788.4607 805.5237 811.1732 818.5553 828.4710 848.7336 885.2647 898.6342 923.2401 947.0255 953.0487 960.4249 965.0342 984.2143 987.9644 990.2208 991.4449 993.6223 993.8243 1019.2099 1032.5829 1039.0667 1048.9632 1052.6505 1106.8044 1108.6191 1119.4041 1169.7277 1172.4733 1184.8459 1190.2782 1218.5144 1221.5003 1251.8974 1269.0083 1297.0841 1300.6222 1316.6553 1381.6130 1382.1243 1392.6033 1398.4264 1403.6986 1439.7371 1445.2194 1466.4340 1470.2288 1472.3494 1474.3552 1479.4474 1566.0470 1589.2906 1594.9274 1595.0251 1595.7822 1613.8078 1619.9364 2980.8515 3063.7737 3093.4503 3126.5481 3129.6026 3137.3618 3138.6298 3139.2682 3140.1009 3150.2226 3153.6769 3164.3377 3167.0472 3167.8245 3168.0070 3229.8819
redmass: 5.7402 5.5175 4.0123 1.0127 6.8621 5.5120 4.7374 5.2827 6.7291 6.2989 4.0904 9.6549 5.4908 5.6458 7.9116 5.1199 5.2541 5.5226 4.4743 4.0703 5.5083 4.8338 7.0249 2.8852 4.6534 4.8238 3.8670 3.2953 4.0094 5.2044 3.4508 5.4963 3.2420 5.6310 7.0177 6.9527 4.3164 4.1872 4.9268 3.2767 2.4369 1.9451 1.4086 4.8143 3.2478 2.4480 2.6528 5.1038 1.4248 1.2461 1.5500 1.6772 6.0705 1.4805 10.0176 1.4410 1.3153 1.3834 1.3807 1.4696 1.4411 4.9512 4.8343 2.6379 2.5508 2.3405 1.6132 2.4654 2.1624 1.6638 1.2850 1.1251 1.1612 1.1460 2.1278 3.0212 2.1879 2.3272 1.2714 1.2630 1.7781 1.7273 8.5986 6.3080 2.9560 1.2201 3.0718 2.2324 2.9819 2.8196 1.1010 2.3345 1.0661 4.1638 10.4483 6.7141 6.9603 6.0316 6.9968 7.3382 7.4690 1.0390 1.0947 1.1001 1.0858 1.0854 1.0892 1.0895 1.0896 1.0898 1.0946 1.0947 1.0956 1.1000 1.0991 1.0974 1.0744
irintensity: 0.9884 1.0256 0.0546 0.4899 0.4656 0.2363 0.9377 1.3647 3.3281 2.3126 2.7338 10.2617 0.9337 11.9534 16.0934 11.6595 7.3746 15.9390 6.3982 2.3430 46.4747 6.1501 71.3475 1.1990 71.2804 3.3604 19.3379 12.4036 7.3933 4.4996 53.9035 93.5771 0.4046 19.9375 3.0571 0.3043 72.0652 7.9341 87.7430 2.4878 134.1674 95.9282 1.8536 5.0705 172.8168 8.4748 29.8650 99.2231 37.3383 0.4316 4.2946 0.2412 59.3718 3.9229 37.9776 3.6924 1.9671 0.0705 0.7194 2.8086 0.5486 2.7189 2.7203 1.9893 3.3229 3.7392 19.9180 33.2063 0.7875 2.1187 7.6308 0.2891 0.0195 16.7273 4.4464 8.1379 5.0773 1.1226 2.7504 2.6133 3.1993 10.1783 9.5416 0.2591 10.2440 16.8448 0.8179 45.4572 37.0475 1.1263 16.4001 27.6156 12.6700 17.0304 2.0282 5.5090 0.1596 14.0203 0.4140 15.6870 5.5977 23.4041 21.0690 13.8471 1.8513 2.7517 12.8628 11.5769 8.5557 0.4461 24.6436 34.3727 1.5613 48.6081 10.8033 6.8086 11.2684
temp: 298.150 k
press: 1.00000 atm
elementType: 16 8 8 7 7 6 6 6 6 6 6 6 6 6 6 6 6 6 6 6 6 6 6 6 6 1 1 1 1 1 1 1 1 1 1 1 1 1 1 1 1
symmnumber: 1
zpe: 804539.8 jmol-1
zpe.correction: 0.306433 hartree
zpe.thermalcorrener: 0.328712 hartree
zpe.thermalcorrenthalpy: 0.329656 hartree
zpe.thermalcorrgfe: 0.250715 hartree
zpe.sumelectzpe: -1427.826408 hartree
zpe.sumelectthermal: -1427.804130 hartree
zpe.sumelectthermalent: -1427.803185 hartree
zpe.sumelectthermalfe: -1427.882126 hartree
dipole: 0.0733 1.7161 -5.2539
dipole: 5.5276
quadrupole: -117.4280 -138.4675 -165.5948
quadrupole: 11.5264 -14.5641 7.8351
quadrupole: 23.0688 2.0293 -25.0980 11.5264 -14.5641 7.8351
hfenergy: -1428.1328411 hartree
pointgroup: C01 [X(C20H16N2O2S1)]
dipole: 0.1426645 -1.6670582 -1.3892296 debye
polarizability: 407.1937376|41.4454997|221.626766|4.7033512|-69.4838686|287.1566809 unknown
InChI: InChI=1S/C20H16N2O2S/c1-14-10-12-15(13-11-14)25(23,24)22-21-20-18-8-4-2-6-16(18)17-7-3-5-9-19(17)20/h2-13,22H,1H3
charge 0 multiplicity 1
41 atoms
S  2.24938 1.4590 1.296327
O  2.962105 1.196087 2.737852
O  1.617467 2.895869 0.873746
N  -0.118873 0.255767 0.422725
N  0.859557 0.039449 1.323831
C  -3.551423 -0.750094 -0.135745
C  -3.240437 -1.557544 1.062918
C  -2.377028 -0.018737 -0.498593
C  -1.873326 -1.317644 1.435228
C  -1.309946 -0.32568 0.482934
C  -4.731679 -0.61831 -0.892639
C  -4.030816 -2.45726 1.800769
C  -2.370868 0.845848 -1.607818
C  -1.295331 -2.010149 2.520813
C  -4.726037 0.247236 -2.014818
C  -3.453753 -3.128532 2.908473
C  -3.558711 0.971901 -2.368759
C  -2.098896 -2.914623 3.259857
C  3.365966 0.872518 -0.088084
C  3.189371 1.435401 -1.361585
C  4.347442 -0.085948 0.211316
C  5.053941 0.024247 -2.150962
C  4.049632 0.998858 -2.392833
C  5.194269 -0.501948 -0.838332
C  5.94999 -0.460144 -3.275483
H  -5.640887 -1.168201 -0.62543
H  -5.074551 -2.645293 1.526563
H  -1.467478 1.406482 -1.866603
H  -0.238368 -1.899227 2.783491
H  -5.634888 0.361872 -2.615953
H  -4.058324 -3.830608 3.493161
H  -3.579573 1.637455 -3.238657
H  -1.664969 -3.458684 4.105473
H  0.626324 -0.0418 2.339551
H  2.423084 2.198291 -1.530275
H  4.458369 -0.472471 1.229344
H  3.938514 1.42213 -3.397537
H  5.975163 -1.24328 -0.63419
H  6.946768 -0.753233 -2.902982
H  5.510556 -1.347592 -3.770859
H  6.085963 0.314092 -4.050037
