program: Gaussian 09
title: 000280360
version: EM64L-G09RevD.01
frameworkgroup: C1[X(C19H28N2O)]
method: RPBEPBE
basis: SDD
operation: Freq
keyword: #p
keyword: freq=noraman
keyword: PBEPBE/SDD
title: #p freq=noraman PBEPBE/SDD
converged: YES YES NO NO
title: Mulliken charges:
elementType: O N N C C C C C C C C C C C C C C C C C C C H H H H H H H H H H H H H H H H H H H H H H H H H H H H
charge: -0.312375 -0.221296 -0.507153 0.041669 -0.077175 -0.442225 -0.453410 -0.408403 -0.410813 -0.396692 -0.395983 -0.403734 -0.388298 -0.387672 -0.390173 0.239837 0.478803 -0.459329 -0.343714 -0.200583 -0.216042 -0.263483 0.168878 0.176081 0.259493 0.199282 0.193497 0.255515 0.195261 0.217045 0.207279 0.200472 0.199395 0.181926 0.182710 0.200046 0.206404 0.194403 0.189937 0.205187 0.193938 0.200990 0.204578 0.193626 0.304488 0.210850 0.308280 0.221463 0.222049 0.225173
chargesum: 0.00000
title: Mulliken charges with hydrogens summed into heavy atoms:
elementType: O N N C C C C C C C C C C C C C C C C C C C
charge: -0.312375 -0.221296 -0.202666 0.210547 0.098906 0.016551 -0.004398 0.003904 -0.003063 -0.015371 -0.013227 -0.002928 0.006825 0.007256 0.008030 0.239837 0.478803 -0.248480 -0.035434 0.020880 0.006007 -0.038310
polarizability: 2.86775364e+02 -3.60436152e-01 2.26538541e+02 5.62665763e-02 1.30713230e+01 1.56397172e+02
1716.lowfreq: -12.7340 -0.0007 -0.0004 0.0006 0.1035 7.9016 29.4487 30.5077 38.1039
frequency: 28.2685 30.4208 38.0539 59.0074 64.5059 68.5146 98.5148 128.6867 136.1031 184.3012 206.0654 213.4151 222.0350 227.0519 246.4929 263.8562 321.5719 327.0165 350.4337 358.4499 403.3865 408.0149 423.4082 426.6430 464.6482 468.1533 485.5507 490.5957 501.6900 529.2055 556.5942 613.7327 638.2210 688.3177 694.6236 707.0516 762.6747 781.8906 788.7122 792.8723 794.6251 832.7257 836.5456 840.5994 845.3526 871.9724 887.5001 893.1211 898.7356 901.4710 908.3231 915.4482 921.8861 966.1365 978.1140 983.3979 994.3621 995.0308 1026.1233 1044.1830 1045.3558 1052.2998 1055.9566 1065.9927 1068.8817 1073.0909 1088.5682 1108.9037 1111.3663 1119.5354 1145.4087 1169.9785 1173.9573 1185.8621 1186.8750 1195.4318 1228.4918 1247.0142 1250.3894 1253.2712 1258.9530 1259.3135 1264.8757 1281.3971 1300.7671 1303.9223 1315.9077 1317.9875 1326.1665 1328.0432 1333.4137 1335.0586 1338.8552 1340.4529 1343.2763 1347.1161 1348.4469 1374.9017 1384.5654 1397.8885 1427.3023 1460.9985 1462.1351 1464.1196 1464.9244 1466.9787 1471.5922 1473.7497 1475.9518 1479.1704 1486.6735 1487.3979 1503.6941 1592.0131 1604.9864 1617.7768 2954.6435 2957.3760 2963.9965 2967.6504 2970.5758 2972.2917 2974.5469 2975.9720 2980.6462 2988.2661 2989.2205 2998.4290 3023.7602 3027.7041 3027.9607 3033.5807 3034.7308 3038.3183 3042.2312 3054.0545 3065.2376 3072.5302 3100.9837 3127.9356 3139.4032 3162.2655 3198.0326 3543.6650
redmass: 3.6249 3.8648 4.1898 3.7491 3.2994 3.5798 4.0379 4.4711 3.4111 3.3987 3.3058 4.5158 1.9293 1.8702 3.7165 3.2420 2.3675 1.7973 5.9391 3.2802 3.6743 2.9718 2.6637 3.1403 2.8250 2.4592 2.5584 1.9473 2.0930 2.4034 1.5457 6.2437 4.3141 4.9452 1.9989 5.2095 1.7019 1.4510 1.9451 1.7357 2.3862 3.2678 1.3429 2.8178 2.2751 1.8500 1.7402 1.8268 1.7834 2.0401 1.4341 1.8450 1.7213 1.3472 2.6612 4.5887 2.5053 1.3441 2.1898 1.7214 1.8010 1.1859 1.3020 2.1847 1.4605 1.4108 1.5967 2.4977 2.5845 3.2123 2.5608 1.0522 2.8059 1.4310 1.1636 1.5910 1.6620 1.3029 1.3373 1.3491 1.5760 1.2842 1.8672 1.5763 1.3156 1.2922 1.4878 1.3660 1.3681 1.3829 1.3742 1.3786 1.4604 1.4807 1.4660 1.4638 1.4600 1.7425 2.1209 1.7506 2.4588 1.0895 1.0909 1.0887 1.0874 1.0889 1.0826 1.0840 1.0880 1.0976 2.3514 1.0963 2.1800 8.0150 3.7053 6.3641 1.0643 1.0639 1.0645 1.0648 1.0607 1.0624 1.0638 1.0762 1.0706 1.0641 1.0762 1.0638 1.0967 1.0956 1.0952 1.0943 1.1014 1.1038 1.1024 1.1030 1.0995 1.0999 1.0884 1.0864 1.0932 1.0999 1.0945 1.0754
irintensity: 0.3412 0.0324 0.3207 0.7402 0.1687 1.7539 0.7791 3.1400 0.8375 2.6286 1.9976 2.2368 0.1954 0.0516 1.1311 0.6796 3.5626 0.0976 5.0328 3.2322 1.8930 0.0496 0.8692 0.0566 3.8765 6.5108 7.6306 1.4117 40.1016 6.3785 20.4127 0.4221 9.8139 16.6206 42.3062 4.2534 86.9963 0.4453 0.7382 0.8756 1.6240 5.3299 0.1577 7.0224 4.3022 0.9454 10.6489 4.9450 18.6232 7.2198 11.7797 0.5745 0.2069 0.1769 11.1630 1.1239 31.6128 2.8744 14.3795 0.4462 0.0093 2.2026 0.7470 4.4085 2.3156 1.8442 11.2005 0.3387 0.6109 45.7711 61.7773 0.7930 21.6547 20.1297 0.2617 3.4035 137.7354 0.5166 27.3938 8.8945 60.9211 0.8563 1.4787 95.8952 7.1594 0.6554 99.2917 19.1216 27.0397 18.5966 1.6904 10.4783 43.4054 42.8957 6.2195 8.3443 18.5795 15.9651 112.7822 42.7810 129.8929 3.3964 4.4283 8.1605 7.4383 6.2207 21.9991 11.1415 10.7986 9.6414 75.5914 5.0186 474.9252 117.0721 126.5716 152.5099 35.0294 46.4244 32.2749 38.8381 36.3556 17.2403 39.5511 14.8883 9.0554 46.6217 42.0201 26.9969 66.9411 90.1213 44.5718 66.4615 14.5651 53.2641 45.3581 89.9505 9.7025 47.3584 21.0983 0.2672 35.3112 30.6156 8.2366 7.1088
temp: 298.150 k
press: 1.00000 atm
elementType: 8 7 7 6 6 6 6 6 6 6 6 6 6 6 6 6 6 6 6 6 6 6 1 1 1 1 1 1 1 1 1 1 1 1 1 1 1 1 1 1 1 1 1 1 1 1 1 1 1 1
symmnumber: 1
zpe: 1149538.4 jmol-1
zpe.correction: 0.437836 hartree
zpe.thermalcorrener: 0.458466 hartree
zpe.thermalcorrenthalpy: 0.459410 hartree
zpe.thermalcorrgfe: 0.387508 hartree
zpe.sumelectzpe: -923.894669 hartree
zpe.sumelectthermal: -923.874039 hartree
zpe.sumelectthermalent: -923.873095 hartree
zpe.sumelectthermalfe: -923.944997 hartree
dipole: -2.4641 4.1539 0.5897
dipole: 4.8657
quadrupole: -128.7843 -129.7148 -136.1940
quadrupole: 2.0677 0.4669 2.3633
quadrupole: 2.7801 1.8496 -4.6296 2.0677 0.4669 2.3633
hfenergy: -924.332505 hartree
pointgroup: C01 [X(C19H28N2O1)]
dipole: -0.9218146 -1.6636645 -0.2168132 debye
polarizability: 286.477485|2.9074356|226.3427556|-5.1661094|13.7198714|156.8908363 unknown
InChI: InChI=1S/C19H28N2O/c22-19(20-16-10-4-1-5-11-16)21(17-12-6-2-7-13-17)18-14-8-3-9-15-18/h1,4-5,10-11,17-18,20H,2-3,6-9,12-15H2
charge 0 multiplicity 1
50 atoms
O  0.525462 1.887827 0.229269
N  -0.803571 -0.036287 0.024882
N  1.549136 -0.159117 -0.303625
C  -2.063233 0.776198 -0.012037
C  -0.933271 -1.520726 0.120148
C  -2.334324 1.550146 1.305814
C  -2.128792 1.720788 -1.240851
C  -1.826025 -1.97026 1.310045
C  -1.418039 -2.16086 -1.210395
C  -3.694773 2.286219 1.240452
C  -3.491439 2.453941 -1.294935
C  -1.870701 -3.514654 1.408053
C  -1.483719 -3.704276 -1.105925
C  -3.76783 3.229155 0.015586
C  -2.362168 -4.15155 0.086482
C  0.42526 0.638494 0.007619
C  2.922639 0.194515 -0.205653
C  3.872017 -0.791059 -0.59873
C  3.384542 1.454204 0.265442
C  5.254185 -0.528116 -0.520265
C  4.772681 1.698703 0.342931
C  5.717494 0.721124 -0.045286
H  -2.882282 0.038755 -0.137436
H  0.071063 -1.927799 0.352103
H  -1.513777 2.272873 1.45922
H  -2.320089 0.846122 2.159896
H  -1.971607 1.131679 -2.165922
H  -1.310026 2.458682 -1.171356
H  -2.858281 -1.591254 1.17758
H  -1.433325 -1.532179 2.246761
H  -0.749467 -1.853715 -2.038892
H  -2.42539 -1.766677 -1.454043
H  -3.853685 2.857636 2.175417
H  -4.519539 1.544129 1.176522
H  -4.307467 1.718616 -1.461743
H  -3.505286 3.14508 -2.159878
H  -2.527242 -3.814383 2.247178
H  -0.857214 -3.900299 1.644946
H  -0.458226 -4.108773 -0.972314
H  -1.871004 -4.1287 -2.051922
H  -4.758957 3.721068 -0.031998
H  -3.011252 4.031729 0.129906
H  -2.359089 -5.25526 0.169674
H  -3.412903 -3.846173 -0.097966
H  1.37557 -1.081908 -0.703046
H  3.524439 -1.766947 -0.964807
H  2.656122 2.216213 0.545761
H  5.968021 -1.30043 -0.828647
H  5.116566 2.673351 0.708386
H  6.791195 0.927655 0.0172
