program: Gaussian 09
title: 000280405
version: EM64L-G09RevD.01
frameworkgroup: C1[X(C22H22N2O2S)]
method: RPBEPBE
basis: SDD
operation: Freq
keyword: #p
keyword: freq=noraman
keyword: PBEPBE/SDD
title: #p freq=noraman PBEPBE/SDD
converged: YES YES NO NO
title: Mulliken charges:
elementType: S O O N N C C C C C C C C C C C C C C C C C C C C C C H H H H H H H H H H H H H H H H H H H H H H
charge: 0.945013 -0.545564 -0.518640 0.036637 -0.493349 -0.513468 0.504893 0.545522 0.117514 -0.437866 -0.457712 -0.391635 -0.349685 -0.784219 -0.045697 -0.224649 -0.226579 -0.242418 -0.267209 -0.245250 -0.255989 -0.268238 -0.171429 0.454929 -0.336514 -0.410626 -0.801392 0.223425 0.231253 0.222923 0.267695 0.253965 0.231037 0.258126 0.254014 0.295800 0.225932 0.223443 0.230787 0.233793 0.229980 0.227309 0.287354 0.297713 0.241934 0.245437 0.237920 0.228936 0.234843
chargesum: 0.00000
title: Mulliken charges with hydrogens summed into heavy atoms:
elementType: S O O N N C C C C C C C C C C C C C C C C C C C C C C
charge: 0.945013 -0.545564 -0.518640 0.036637 -0.197549 -0.290043 0.504893 0.545522 0.117514 -0.206613 -0.234789 -0.123940 -0.095719 -0.041042 -0.045697 0.001283 -0.003136 -0.011631 -0.033415 -0.015270 -0.028680 0.019116 0.126284 0.454929 -0.094580 -0.165189 -0.099693
polarizability: 3.68346097e+02 1.98511883e+01 2.82403030e+02 -1.50165566e+00 1.31186287e+01 2.10901971e+02
1716.lowfreq: -15.8595 -7.2240 -6.0466 -2.4582 -0.0005 0.0003 0.0007 5.8550 11.9332
frequency: -15.7126 2.3654 10.5487 31.2993 32.9875 34.4774 44.6570 47.7641 69.2713 72.1976 93.6209 113.6681 130.3399 137.8066 142.5821 170.2914 210.9732 213.7841 223.4715 248.6101 266.1061 278.0410 291.1903 300.8798 333.9823 350.5538 368.1927 397.3095 402.2462 405.1588 406.2104 417.8520 435.0897 479.2630 502.8979 507.9882 519.2531 585.1523 606.8035 609.1964 615.7406 620.9697 621.4518 661.8116 701.0590 708.8157 709.5808 748.0100 756.3544 776.3290 783.7847 806.2955 817.2231 827.3652 847.8496 850.1041 854.9843 858.3147 869.3305 918.5853 931.1664 946.4751 962.3119 971.5362 973.4981 982.8157 983.7089 987.0608 989.7918 991.5841 993.0402 997.4259 1000.3383 1014.3989 1027.3166 1027.6230 1050.1542 1052.3848 1060.0278 1079.9656 1090.3732 1120.8675 1170.1429 1172.7857 1178.8287 1186.2624 1190.9296 1195.9289 1200.3522 1213.1100 1218.0463 1247.5780 1277.6247 1296.4393 1299.5165 1335.4866 1342.3385 1380.6840 1380.8439 1385.4031 1387.1454 1391.8813 1400.4432 1439.9623 1441.3015 1456.5743 1469.5205 1470.3922 1473.1759 1474.9161 1480.1078 1483.4525 1589.5635 1592.4841 1593.2165 1597.0760 1599.2696 1608.0449 1612.6341 2957.1842 2974.4188 2981.5819 3033.0868 3060.7753 3091.7021 3105.5168 3110.4769 3115.9097 3119.6809 3122.9135 3133.4027 3133.5984 3137.2999 3141.3030 3144.9910 3154.6214 3162.1263 3163.1429 3168.7776 3172.1774 3202.4253
redmass: 1.0387 4.6908 5.4577 4.9760 4.2964 5.1547 4.5794 4.5693 4.7439 3.7640 4.0405 3.5082 5.3330 1.3727 4.1023 7.3772 5.9405 4.6901 7.0626 4.5307 5.1526 4.6127 5.0112 3.8948 3.4605 4.7071 4.1351 8.8654 2.8165 2.8715 2.8674 6.8438 4.4242 3.5765 3.1503 3.2564 4.1777 5.4408 3.7283 4.5424 6.2996 5.7104 6.9566 3.9483 1.7880 3.2548 1.7503 2.0809 2.0800 4.4119 2.8174 6.0996 3.6930 1.3968 1.2530 1.2566 3.2383 1.3482 2.3561 1.5559 1.4825 11.4480 1.3562 1.4152 1.8076 1.4081 1.3848 1.7901 4.3562 4.8997 1.4569 2.7950 1.3619 1.5907 2.2713 2.2397 1.5925 2.5642 3.1902 1.6458 1.6450 1.2917 1.0812 1.0700 2.6683 1.1351 1.1172 1.1343 2.2423 1.9696 3.0383 1.5933 1.3092 1.7759 1.2913 1.2811 1.3266 5.2229 7.4865 5.0386 1.2602 2.7891 1.3267 2.1972 2.0892 1.0701 1.0730 1.0473 2.3277 1.1114 2.1617 2.2498 6.6689 6.6492 6.0099 6.2715 7.2895 6.0737 6.1156 1.0417 1.0826 1.0376 1.0937 1.0973 1.0990 1.0973 1.0871 1.0870 1.0876 1.0868 1.0908 1.0893 1.0927 1.0902 1.0957 1.0975 1.0957 1.1014 1.0971 1.0963 1.0737
irintensity: 0.4450 1.0858 0.6640 0.9454 0.1771 0.8091 0.7192 0.4374 0.3428 1.8930 1.6239 0.4382 2.1152 0.9293 1.1251 2.9307 4.2892 2.5745 15.3007 0.3440 9.4762 1.8891 8.8105 0.7043 12.6366 3.3476 14.8629 32.9979 1.1568 0.0676 0.4602 44.0348 38.1183 3.4013 26.7486 35.6148 35.8333 16.9774 2.4739 11.0673 0.3919 7.0444 0.3721 31.7024 45.4617 1.0085 61.7876 116.8027 51.2151 5.7636 41.5082 58.4093 54.1569 30.3061 2.9651 2.7948 0.5408 3.2507 39.1051 10.1772 3.3371 66.9635 0.9567 0.6852 6.2125 0.1674 0.3528 3.2270 1.8251 1.0845 0.6000 4.3411 0.2622 4.8215 6.8152 7.6120 14.5730 21.3715 2.7394 0.6024 16.6573 8.9341 0.3771 0.1144 2.4279 7.1684 1.3905 0.9094 2.7722 18.6852 4.6045 1.6067 2.5441 9.0458 5.4598 1.4945 4.2634 2.7295 0.4478 2.3772 31.3014 13.3719 16.2419 13.8312 1.4128 22.4917 11.0788 12.9807 23.4334 17.2244 33.6311 11.8727 11.0957 5.4644 0.5812 5.5352 33.1732 8.5468 1.7655 13.7400 19.9434 27.4328 14.8369 15.9246 15.2937 14.5265 7.3332 6.3424 2.2641 1.5004 7.3045 13.8482 27.1096 10.4448 31.0699 35.6137 6.6786 32.5991 4.0371 13.6667 7.6135
temp: 298.150 k
press: 1.00000 atm
elementType: 16 8 8 7 7 6 6 6 6 6 6 6 6 6 6 6 6 6 6 6 6 6 6 6 6 6 6 1 1 1 1 1 1 1 1 1 1 1 1 1 1 1 1 1 1 1 1 1 1
symmnumber: 1
zpe: 1003083.6 jmol-1
zpe.correction: 0.382054 hartree
zpe.thermalcorrener: 0.407788 hartree
zpe.thermalcorrenthalpy: 0.408733 hartree
zpe.thermalcorrgfe: 0.320384 hartree
zpe.sumelectzpe: -1507.422373 hartree
zpe.sumelectthermal: -1507.396639 hartree
zpe.sumelectthermalent: -1507.395695 hartree
zpe.sumelectthermalfe: -1507.484043 hartree
dipole: -0.0513 3.6676 3.5292
dipole: 5.0901
quadrupole: -135.7110 -169.0391 -164.0404
quadrupole: 17.4079 -0.4118 -5.0644
quadrupole: 20.5525 -12.7756 -7.7769 17.4079 -0.4118 -5.0644
hfenergy: -1507.8044273 hartree
pointgroup: C01 [X(C22H22N2O2S1)]
dipole: -0.0397044 1.4852288 1.3427429 debye
polarizability: 367.3659156|21.7654703|284.0767889|-3.9290835|10.5724354|210.2083939 unknown
InChI: InChI=1S/C22H22N2O2S/c1-17-13-15-21(16-14-17)27(25,26)24-23-18(2)22(19-9-5-3-6-10-19)20-11-7-4-8-12-20/h3-16,22,24H,1-2H3
charge 0 multiplicity 1
49 atoms
S  1.852618 -2.266893 -0.452054
O  2.539681 -3.714053 -0.161817
O  0.966064 -1.993275 -1.789203
N  -0.123784 -0.930024 0.860625
N  0.741836 -1.967259 1.135124
C  -2.175718 0.373486 1.130322
C  -3.423093 -0.132574 0.374594
C  -1.456907 1.511117 0.391053
C  -1.270893 -0.809959 1.48999
C  -4.690657 0.438348 0.651437
C  -1.165347 2.711031 1.085274
C  -3.329576 -1.13975 -0.620424
C  -1.072459 1.40244 -0.969338
C  -1.752013 -1.790948 2.542542
C  3.130724 -0.911884 -0.252877
C  -5.841449 0.02044 -0.05311
C  -0.505062 3.783106 0.441635
C  -4.479778 -1.560687 -1.324734
C  -0.412421 2.470279 -1.615709
C  -5.739388 -0.982606 -1.045002
C  -0.12621 3.666317 -0.914579
C  4.392834 -1.278307 0.242575
C  2.780119 0.399968 -0.606022
C  5.06269 1.087592 0.038791
C  5.35995 -0.260739 0.378388
C  3.767242 1.399427 -0.44955
C  6.119135 2.16656 0.193119
H  -2.535237 0.792116 2.09315
H  -4.773639 1.22163 1.415617
H  -1.454343 2.809143 2.139717
H  -2.358168 -1.59613 -0.846144
H  -1.284049 0.485349 -1.526754
H  -1.780372 -2.830026 2.152807
H  -2.76853 -1.542156 2.884611
H  -1.069783 -1.789644 3.414963
H  0.338988 -2.911533 1.345442
H  -6.813742 0.473724 0.170981
H  -0.29279 4.704837 0.995428
H  -4.391465 -2.337905 -2.09221
H  -0.127672 2.371004 -2.669618
H  -6.630735 -1.310085 -1.591711
H  0.376039 4.498219 -1.421759
H  4.605012 -2.321519 0.498067
H  1.779656 0.640556 -0.9770
H  6.357413 -0.516162 0.754836
H  3.517826 2.435023 -0.706425
H  6.976812 1.983005 -0.481123
H  5.716117 3.166295 -0.040144
H  6.517124 2.192608 1.224322
