program: Gaussian 09
title: 000280306
version: EM64L-G09RevD.01
frameworkgroup: C1[X(C10H8N2O4)]
method: RPBEPBE
basis: SDD
operation: Freq
keyword: #p
keyword: freq=noraman
keyword: PBEPBE/SDD
title: #p freq=noraman PBEPBE/SDD
converged: NO YES NO NO
title: Mulliken charges:
elementType: O O O O N N C C C C C C C C C C H H H H H H H H
charge: -0.401241 -0.242751 -0.210813 -0.248906 -0.453266 0.017657 0.065975 0.332468 0.438044 -0.547992 0.310661 -0.618930 -0.433914 -0.377444 -0.209905 0.209981 0.403833 0.266085 0.273869 0.275883 0.248318 0.280806 0.234279 0.387303
chargesum: 0.00000
title: Mulliken charges with hydrogens summed into heavy atoms:
elementType: O O O O N N C C C C C C C C C C
charge: -0.013938 -0.242751 -0.210813 -0.248906 -0.049433 0.017657 0.065975 0.332468 0.438044 -0.281908 0.310661 -0.069178 -0.185597 -0.096638 0.024375 0.209981
polarizability: 2.02296411e+02 4.31768338e+00 1.66369100e+02 -7.89365381e+00 1.43904365e+00 6.09104189e+01
1716.lowfreq: -7.9609 -5.3819 -4.5628 0.0006 0.0007 0.0008 24.2216 45.0718 75.2444
frequency: 24.2168 45.0408 75.2390 87.6839 136.0240 146.2510 191.3624 266.0949 281.5356 312.1878 324.0784 369.6426 413.2630 466.3293 489.1940 502.5421 564.9399 567.5338 608.6419 624.2988 637.4070 663.8958 693.5874 719.1703 731.9400 772.4827 778.8240 805.8528 825.5329 864.7604 872.9550 928.5689 940.8617 971.9337 980.2860 985.0607 1056.5632 1060.2700 1143.8340 1149.4915 1183.1512 1193.1692 1197.4183 1244.2021 1256.3017 1307.8785 1312.6408 1344.6310 1361.0274 1384.3565 1415.6852 1436.6346 1471.5067 1484.9492 1564.2125 1588.6896 1632.3105 1660.5643 2959.0531 3091.7347 3142.4933 3162.9320 3184.8165 3222.2879 3503.8421 3507.4059
redmass: 4.8092 10.0286 11.6982 9.5625 3.9967 5.7057 8.5809 4.1181 5.2903 5.1579 5.6306 9.6670 7.3020 4.0618 2.9421 3.8269 5.1287 3.4672 3.3139 5.3078 4.9181 1.5281 6.5882 7.0974 3.0441 3.9279 1.2827 1.4148 1.6062 4.1883 4.0691 1.4164 2.3015 5.4610 1.3435 4.1835 2.1728 1.9116 1.2935 2.0625 1.4245 1.3751 1.7071 3.4166 1.5795 2.7329 3.4520 5.4560 2.9506 3.8049 2.7960 1.1277 3.4505 6.4570 6.8477 6.0884 8.9567 8.1056 1.0696 1.0893 1.0880 1.0936 1.0961 1.0985 1.0769 1.0684
irintensity: 0.5473 0.4616 0.1583 0.7416 5.3775 0.3628 9.9503 0.1830 0.2704 0.4681 6.4358 1.3839 8.1106 1.5111 12.7556 23.4499 29.7913 0.1431 13.6148 8.4930 9.4308 146.0155 8.9861 3.8399 17.9798 10.1933 37.4751 28.4503 121.7916 5.1809 11.5504 0.5604 19.0309 10.6963 2.3852 3.2308 283.0353 137.3976 51.0835 50.0866 15.5957 29.1792 122.5000 243.7282 14.1177 37.2432 56.9759 155.1423 15.8831 78.5083 42.8412 22.1233 9.2307 27.6824 35.6151 41.9116 43.3756 134.6359 15.4088 1.6891 4.0768 17.4092 5.0167 2.8550 157.6084 11.4695
temp: 298.150 k
press: 1.00000 atm
elementType: 8 8 8 8 7 7 6 6 6 6 6 6 6 6 6 6 1 1 1 1 1 1 1 1
symmnumber: 1
zpe: 447961.2 jmol-1
zpe.correction: 0.170619 hartree
zpe.thermalcorrener: 0.183837 hartree
zpe.thermalcorrenthalpy: 0.184781 hartree
zpe.thermalcorrgfe: 0.129070 hartree
zpe.sumelectzpe: -795.076373 hartree
zpe.sumelectthermal: -795.063155 hartree
zpe.sumelectthermalent: -795.062211 hartree
zpe.sumelectthermalfe: -795.117922 hartree
dipole: -3.6629 -5.2062 0.1270
dipole: 6.3669
quadrupole: -76.0970 -97.4868 -91.5475
quadrupole: -12.3099 -0.9173 -0.9903
quadrupole: 12.2801 -9.1097 -3.1704 -12.3099 -0.9173 -0.9903
hfenergy: -795.246992 hartree
pointgroup: C01 [X(C10H8N2O4)]
dipole: 1.6234326 -1.8440469 -0.4885299 debye
dipolederiv: -1.4696331 -0.0021778 -0.1285043 -0.0674916 -0.2609972 0.0773833 -0.2943653 0.0619315 -0.4131118 -0.913342 -0.0054425 -0.0418035 0.2274936 -0.7105165 -0.1338282 -0.0058626 -0.1924528 -0.3923012 -0.8595356 0.4047891 0.1410331 0.3064462 -0.659755 -0.0933048 0.1351377 -0.1132256 -0.2657716 -0.5805775 -0.3177932 0.0167909 -0.0950707 -0.7402123 -0.0356958 0.0399641 0.0062811 -0.2565451 -0.7990211 0.2271138 0.107557 -0.2359578 -0.4517935 0.0219515 0.1190888 -0.0186665 -0.2382633 1.1458198 -0.167709 -0.1665204 -0.4033803 1.8317645 0.2392106 -0.1964144 0.2063907 0.2448918 0.286613 -0.1702858 -0.0629343 0.6562132 0.0627622 -0.1127707 0.0315282 0.0295022 0.0425246 0.1469045 0.0492244 -0.0202456 -0.5400128 -0.2136839 0.0555877 -0.0655623 -0.0299717 0.0285857 0.3771881 -0.0578514 -0.0436685 -0.086731 0.5266651 0.0282707 -0.2203309 0.0053389 0.0187126 -0.2109913 -0.2195557 -0.0503227 -0.0425393 -0.1139362 0.0328742 -0.0215225 0.0525254 -0.2585883 0.1822398 -0.0410871 -0.0244828 0.2661987 -0.8788876 -0.1440915 0.000504 -0.0953998 0.0311606 -0.0049087 -0.027149 -0.0614179 -0.132081 -0.0939235 -0.1448434 -0.0361457 -0.18193 -0.0191837 0.3466703 -0.2614153 -0.1075436 0.0656803 0.1683755 0.0235157 -0.0797533 0.0771144 -0.1097649 -0.2685263 0.2137504 0.0422372 -0.2813082 0.3751652 0.0998777 -0.0063181 0.018019 -0.1193731 -0.1673998 0.3251383 0.0301263 0.3688784 -0.2821583 -0.0726303 0.0364234 -0.0664312 -0.186111 1.8278003 -0.0288903 0.2522905 -0.0662378 0.899365 0.3003705 0.3990103 0.3678165 0.4583928 0.4447948 0.079735 0.0225539 0.0861621 0.2886018 -0.0064818 0.033783 -0.0252308 0.3119962 0.0405361 0.0551742 0.0318517 0.0795315 0.0184571 -0.0326462 0.032939 -0.0282396 0.1868153 -0.0192805 -0.0575943 0.0191721 -0.1071294 0.052556 0.0568012 0.0812956 0.0512917 -0.0098312 0.0182229 0.0239124 -0.0145425 0.0531872 -0.0046464 0.0061578 -0.0337577 0.0278785 0.1286576 0.0958259 0.0350306 0.0146363 0.0005626 -0.0768225 -0.0258402 0.0135702 -0.0317485 0.1517593 0.0537492 0.0167247 0.0221832 0.0496007 0.1033481 -0.0164941 0.025836 -0.0111382 0.1652786 -0.0431192 -0.1026111 0.023446 -0.090649 0.008657 -0.0009697 0.0262869 0.000474 0.1583331 0.3699706 0.0289694 -0.0018923 -0.0113658 0.1516155 -0.1224041 -0.0153344 -0.1101294 0.3417368 unknown
polarizability: 201.1239322|2.0435005|163.4560977|-17.0275968|15.7672358|64.9958994 unknown
InChI: InChI=1S/C10H8N2O4/c13-9(14)5-7-4-6-2-1-3-8(12(15)16)10(6)11-7/h1-4,11,13H,5H2
charge 0 multiplicity 1
24 atoms
O  4.874635 0.776343 0.28629
O  2.860727 1.922154 0.384055
O  -3.321597 2.194045 0.635614
O  -1.081966 2.5014 0.302865
N  0.573922 0.374193 -0.234561
N  -2.137347 1.739443 0.392174
C  -0.662567 -0.226402 -0.080386
C  -0.486451 -1.649842 -0.262477
C  1.541096 -0.612158 -0.496743
C  0.921925 -1.861915 -0.520907
C  -1.946896 0.302875 0.203395
C  2.982494 -0.269026 -0.769335
C  -1.606334 -2.509098 -0.16028
C  -3.054704 -0.568297 0.300815
C  -2.879569 -1.961051 0.11944
C  3.512067 0.914335 0.027567
H  0.756458 1.371739 -0.081198
H  1.414204 -2.814921 -0.705059
H  3.117283 0.002382 -1.83903
H  3.624725 -1.145194 -0.589829
H  -1.48932 -3.589761 -0.294873
H  -4.036548 -0.138853 0.517113
H  -3.749167 -2.620731 0.199347
H  5.208025 1.58484 0.764402
