program: Gaussian 09
title: 000280292
version: EM64L-G09RevD.01
frameworkgroup: C1[X(C5H6N4O)]
method: RPBEPBE
basis: SDD
operation: Freq
keyword: #pfreq=noraman
keyword: PBEPBE/SDD
title: #p freq=noraman PBEPBE/SDD
converged: NO YES NO NO
title: Mulliken charges:
elementType: O N N N N C C C C C H H H H H H
charge: -0.319295 -0.053586 -0.045611 -0.616510 -0.610578 -0.022297 0.134858 0.209019 -0.320703 -0.237814 0.245247 0.240243 0.322929 0.384061 0.356459 0.333578
chargesum: 0.00000
title: Mulliken charges with hydrogens summed into heavy atoms:
elementType: O N N N N C C C C C
charge: -0.319295 -0.053586 -0.045611 0.090479 0.079459 -0.022297 0.134858 0.209019 -0.075455 0.002429
polarizability: 1.15603900e+02 5.55018257e+00 1.05441611e+02 3.43843294e-03 -9.63170224e-04 3.47913870e+01
1716.lowfreq: -7.1817 0.0002 0.0008 0.0008 11.9280 12.7821 105.3930 124.6909 238.3926
frequency: 105.3881 124.6901 238.3908 239.3983 350.0664 396.2558 432.7024 494.8062 529.9741 566.1376 570.7652 594.1670 603.1807 691.5183 703.1538 707.9060 781.2507 817.2301 842.6786 893.3028 939.9761 985.0943 1055.1595 1070.2928 1137.5356 1221.5447 1283.9542 1330.6486 1384.9115 1425.5881 1450.2050 1496.6604 1509.1258 1554.0268 1596.8405 1623.7679 3135.8262 3169.8416 3360.2228 3487.3545 3625.0019 3667.9484
redmass: 6.1814 6.6000 4.4946 4.3753 3.4843 6.6157 4.4498 3.7513 1.8645 7.7013 1.4921 1.4875 5.0617 1.0895 5.3828 5.1780 1.2570 4.1300 1.2766 7.2896 1.4490 2.7674 2.1735 2.2132 2.5599 2.0448 6.9726 1.7379 2.5775 2.9218 2.3014 3.4874 4.8979 1.3651 2.6735 3.6902 1.0894 1.0974 1.0568 1.0467 1.0946 1.1024
irintensity: 4.8372 0.5665 15.4122 18.9545 6.6294 0.9648 5.3866 12.5162 16.4013 0.3688 35.0293 288.2562 29.2064 85.1322 3.6146 23.9006 104.3789 78.1096 15.2932 6.1331 0.3086 0.9353 4.1288 2.8653 29.2865 8.9093 141.1806 13.2539 58.7874 47.0824 2.5984 84.6901 5.1571 204.5604 416.6480 256.9908 9.8976 29.1698 150.4349 53.5179 82.3791 75.4779
temp: 298.150 k
press: 1.00000 atm
elementType: 8 7 7 7 7 6 6 6 6 6 1 1 1 1 1 1
symmnumber: 1
zpe: 312192.4 jmol-1
zpe.correction: 0.118908 hartree
zpe.thermalcorrener: 0.127079 hartree
zpe.thermalcorrenthalpy: 0.128023 hartree
zpe.thermalcorrgfe: 0.086004 hartree
zpe.sumelectzpe: -487.667568 hartree
zpe.sumelectthermal: -487.659397 hartree
zpe.sumelectthermalent: -487.658453 hartree
zpe.sumelectthermalfe: -487.700472 hartree
dipole: -0.6325 -1.6825 0.0015
dipole: 1.7974
quadrupole: -54.9475 -49.4531 -60.4633
quadrupole: -3.2787 0.0022 0.0063
quadrupole: 0.0071 5.5015 -5.5087 -3.2787 0.0022 0.0063
hfenergy: -487.7864759 hartree
pointgroup: C01 [X(C5H6N4O1)]
dipole: 0.2612966 0.6568502 -0.0188953 debye
dipolederiv: -0.8408535 -0.232873 0.0101986 -0.100814 -0.8899099 0.0140369 0.0065637 0.0149361 -0.3868549 0.2578395 0.10559 -0.0071905 0.4646175 -0.2044156 -0.004747 -0.0164211 -0.001462 -0.2219119 -0.2359496 -0.5344343 0.0134758 0.1354359 -0.5293596 0.0050156 -0.0040129 0.0112713 -0.2905256 -0.3694344 -0.4234111 0.0084134 -0.3494036 -1.2197801 0.0182266 0.0064526 0.0188452 -0.6482148 -0.6935202 0.4622821 -0.0114957 0.4382012 -0.9931459 0.004472 -0.0110136 0.0044528 -0.6658147 -0.4377861 0.3471767 -0.0047348 -0.6253686 -0.3628347 0.0162682 0.0206456 0.0072669 0.0397909 0.0493125 0.5686149 -0.0130702 0.5477936 1.3003682 -0.0325629 -0.0124046 -0.0327524 0.252391 1.4800585 -0.2637925 -0.0045106 -0.2355856 1.3662802 -0.0275928 -0.0051993 -0.0271943 0.2209295 -0.5958787 0.0419367 0.0034912 0.4301242 0.0577795 -0.007881 -0.006552 -0.0043674 -0.0925732 0.3980119 0.1624628 -0.0078681 -0.5083984 0.4004527 -0.0055969 0.0095988 -0.0117714 0.0061136 0.0290673 -0.0616201 0.0028457 -0.1047733 -0.0532795 0.0066183 0.0039757 0.0062624 0.1633313 -0.118199 -0.0500026 0.0035396 -0.0146194 0.0977101 0.0008058 0.0026216 0.0011242 0.1234731 0.1462399 0.0303624 0.0012877 0.0168332 0.2592671 0.0027381 0.0016225 0.0026907 0.3695601 0.405861 -0.0539062 0.0011536 -0.0270368 0.3223673 0.0015091 0.0005349 0.0016772 0.3722806 0.3223276 -0.0489893 0.0015849 -0.0443425 0.24686 0.0035874 0.0014395 0.0036711 0.3683767 0.2029032 -0.0493966 0.0028793 -0.0226633 0.2016402 0.0051026 0.0021485 0.0053495 0.3896483 unknown
polarizability: 115.8034963|5.3327806|105.1850155|-0.8763238|-1.8820804|34.848386 unknown
InChI: InChI=1S/C5H6N4O/c6-4-3(5(7)10)8-1-2-9-4/h1-2H,6-7H2
charge 0 multiplicity 1
16 atoms
O  -2.444122 -0.901387 0.075352
N  0.328838 1.43906 -0.0099
N  1.878006 -0.946881 0.037716
N  -0.090547 -2.231629 0.08963
N  -2.365259 1.434326 0.014352
C  -0.279926 0.219427 0.02745
C  0.495084 -1.001362 0.052041
C  -1.778048 0.195616 0.041579
C  1.687563 1.483028 -0.023638
C  2.447497 0.282483 0.000489
H  2.163959 2.466271 -0.053694
H  3.542692 0.311394 -0.010424
H  0.508677 -3.055614 0.105616
H  -1.120714 -2.264845 0.100245
H  -1.753475 2.25384 -0.01223
H  -3.379925 1.512872 0.020917
