program: Gaussian 09
title: 000280289
version: EM64L-G09RevD.01
frameworkgroup: C1[X(C6H9NOS)]
method: RPBEPBE
basis: SDD
operation: Freq
keyword: #p
keyword: freq=noraman
keyword: PBEPBE/SDD
title: #p freq=noraman PBEPBE/SDD
converged: NO YES NO NO
title: Mulliken charges:
elementType: S O N C C C C C C H H H H H H H H H
charge: 0.260957 -0.452765 -0.114344 -0.484877 0.438821 -0.321865 -0.314308 -0.745971 -0.473797 0.243091 0.197342 0.211222 0.180390 0.248091 0.245414 0.233898 0.276226 0.372478
chargesum: 0.00000
title: Mulliken charges with hydrogens summed into heavy atoms:
elementType: S O N C C C C C C
charge: 0.260957 -0.080288 -0.114344 -0.044444 0.438821 -0.321865 0.077304 -0.018569 -0.197572
polarizability: 1.13861560e+02 7.16354659e-01 9.84485087e+01 -3.28505628e+00 2.79941407e-01 5.10856636e+01
1716.lowfreq: -5.0636 -0.0019 0.0027 0.0029 8.1500 11.7893 48.3721 97.8972 141.5212
frequency: 48.3249 97.8350 141.5157 156.4345 222.8895 241.5205 311.8322 346.3926 445.2674 483.0985 518.2181 594.7160 659.3215 669.4506 709.2397 747.0651 771.4166 836.3088 857.6796 932.3950 1013.1143 1039.6454 1055.4290 1070.5287 1126.2040 1183.0144 1219.7898 1229.9713 1293.7448 1319.8278 1356.4216 1404.1420 1422.1116 1441.3513 1445.7668 1462.7479 1467.4898 1478.1454 1563.6026 2937.0788 2982.8886 2986.1786 3050.8024 3060.2204 3060.5777 3092.4066 3228.5485 3297.4273
redmass: 4.4740 1.0424 3.4881 5.0430 2.7908 3.6226 2.5835 4.4876 3.0407 4.7627 4.8792 4.0243 7.2712 2.3264 1.6058 3.3691 1.2570 3.7322 2.5209 1.8991 3.0289 1.4280 2.1009 1.9743 3.2041 1.1196 1.2073 1.5576 2.7043 1.4434 1.3952 1.2234 1.3213 1.1254 4.0109 1.0446 1.1109 1.0900 6.1187 1.0699 1.0371 1.0613 1.0986 1.0941 1.0982 1.0975 1.0958 1.0665
irintensity: 1.5985 0.6099 1.2003 5.2948 4.2775 1.3156 7.2261 2.1361 4.4648 0.8993 3.6769 4.6387 7.0526 62.5644 77.8377 30.1946 36.7504 26.2653 7.5793 21.6792 28.6606 5.5482 39.2955 27.5966 13.9635 16.6581 16.5332 0.5326 0.6906 2.5488 27.2359 20.0073 154.6915 35.5468 17.7475 14.9750 4.6641 1.8922 15.2997 84.6702 22.3783 23.0325 28.7398 65.4398 18.3409 12.5605 1.1074 235.5906
temp: 298.150 k
press: 1.00000 atm
elementType: 16 8 7 6 6 6 6 6 6 1 1 1 1 1 1 1 1 1
symmnumber: 1
zpe: 371321.4 jmol-1
zpe.correction: 0.141429 hartree
zpe.thermalcorrener: 0.150802 hartree
zpe.thermalcorrenthalpy: 0.151746 hartree
zpe.thermalcorrgfe: 0.106284 hartree
zpe.sumelectzpe: -761.362295 hartree
zpe.sumelectthermal: -761.352922 hartree
zpe.sumelectthermalent: -761.351977 hartree
zpe.sumelectthermalfe: -761.397439 hartree
dipole: -3.7439 2.3411 0.4108
dipole: 4.4347
quadrupole: -72.9649 -52.9043 -62.6714
quadrupole: 5.6852 1.2314 -0.2503
quadrupole: -10.1180 9.9426 0.1755 5.6852 1.2314 -0.2503
hfenergy: -761.5037235 hartree
pointgroup: C01 [X(C6H9N1O1S1)]
dipole: -1.3230731 1.1315077 0.1150469 debye
dipolederiv: -0.5093152 0.0811295 0.0815964 0.173918 -0.2131379 0.0201535 0.1099945 0.0300796 0.1098382 -0.6689124 0.064605 -0.0731229 0.0957142 -0.7516551 -0.0207415 -0.0970831 -0.0161624 -0.566384 -0.9272688 0.1622684 0.084857 -0.1044497 -0.2069437 0.0222927 0.1304316 -0.0294473 -0.1759165 -0.1206794 0.0588625 -0.0520067 0.1258839 0.0478075 0.0344451 -0.0879241 0.0725821 0.067588 0.2611813 0.1584419 -0.0802855 0.1335983 -0.0891979 -0.0074439 -0.1481995 -0.0125245 0.0110189 0.1862997 -0.0005468 -0.0764374 0.1293068 0.3417399 -0.1055794 -0.0721686 -0.0857678 -0.1759692 0.3828815 -0.0349752 0.0273487 -0.0897507 0.5786256 0.1114605 0.1618961 0.0496496 0.4265321 -0.0040359 0.011176 0.0137502 0.0006036 -0.0922322 0.0278694 0.0083295 0.0373108 0.1042939 0.7385938 -0.416279 -0.1099428 -0.2438079 0.109076 0.0072542 -0.1497144 0.0423795 -0.1706414 -0.0130189 -0.024308 0.03377 -0.0306343 0.1010275 -0.033349 0.0441976 0.0105905 -0.1147518 0.049981 0.0652188 0.0052664 -0.0089355 -0.1671775 -0.0226167 -0.0100926 -0.0450204 0.0905356 -0.1669488 -0.1100928 0.0241758 -0.0819236 -0.0126583 0.0001803 0.0475654 0.0358114 0.0707127 0.0621608 0.0462405 0.0694905 0.0250815 -0.0312254 -0.0458845 -0.0179477 -0.0792772 -0.2422067 0.0089645 0.0561505 -0.1101245 0.0232478 0.0405159 0.0114283 -0.1109793 0.0553385 -0.008873 0.0671022 0.060738 0.0797001 0.0412017 0.0223124 -0.0313813 0.0863721 -0.089974 -0.0387317 -0.0286304 -0.1315728 0.0343226 -0.069817 0.0138452 0.0209111 0.0288366 0.02733 0.1062402 0.0631281 0.029008 0.0196784 -0.0185047 0.0153932 0.0270818 0.0283107 0.0188997 0.1897278 0.6185171 -0.0760646 0.0279637 -0.1007326 0.2938848 -0.0160805 0.0481755 -0.0217979 0.3169871 unknown
polarizability: 112.8644416|-2.3486645|97.872882|-7.9535688|-5.5286889|52.6584086 unknown
InChI: InChI=1S/C6H9NOS/c1-5-6(2-3-8)7-4-9-5/h4,8H,2-3H2,1H3
charge 0 multiplicity 1
18 atoms
S  -2.422302 -0.348466 0.349805
O  2.807267 -1.220947 -0.164538
N  0.05722 -1.198114 -0.010845
C  1.436592 0.828869 -0.554909
C  0.100741 0.206764 -0.205582
C  -1.121453 0.855116 -0.058427
C  2.611952 0.17277 0.218993
C  -1.463573 2.312244 -0.195761
C  -1.150978 -1.638071 0.279561
H  1.632478 0.69908 -1.638023
H  1.417305 1.915796 -0.352699
H  3.55326 0.691934 -0.03136
H  2.437588 0.271262 1.313949
H  -2.162546 2.490925 -1.034018
H  -1.934248 2.712397 0.72095
H  -0.552044 2.901703 -0.39215
H  -1.409783 -2.678155 0.471641
H  1.900725 -1.650306 -0.100889
