program: Gaussian 09
title: 000280282
version: EM64L-G09RevD.01
frameworkgroup: C1[X(C11H15NO2)]
method: RPBEPBE
basis: SDD
operation: Freq
keyword: #p
keyword: freq=noraman
keyword: PBEPBE/SDD
title: #p freq=noraman PBEPBE/SDD
converged: YES YES NO NO
title: Mulliken charges:
elementType: O O N C C C C C C C C C C C H H H H H H H H H H H H H H H
charge: -0.438595 -0.438805 -0.123767 -0.262926 -0.471354 0.363183 -0.453464 0.160444 -0.011202 -0.443884 -0.620120 0.321508 -0.413789 -0.865226 0.234427 0.200848 0.243410 0.257731 0.208986 0.241335 0.232284 0.193911 0.226913 0.229339 0.343606 0.231147 0.251023 0.232807 0.370232
chargesum: 0.00000
title: Mulliken charges with hydrogens summed into heavy atoms:
elementType: O O N C C C C C C C C C C C
charge: -0.094990 -0.068574 -0.123767 -0.028499 -0.027096 0.363183 0.013253 0.160444 -0.011202 -0.202549 0.032988 0.321508 -0.184451 -0.150249
polarizability: 1.68886928e+02 1.46226588e-01 1.40195338e+02 -1.67277482e+00 -3.79360236e+00 8.21782270e+01
1716.lowfreq: -15.4635 -4.2061 -0.0006 0.0004 0.0005 4.6681 64.7149 87.3568 118.1871
frequency: 64.6488 87.3470 118.1742 146.9951 151.9794 196.9097 215.3856 226.8247 275.6744 290.3809 299.7533 312.7382 330.0173 360.0933 378.9695 426.2182 482.8796 498.1231 518.3541 552.8168 555.1675 617.9348 670.8865 692.5896 733.0276 747.1629 818.9822 825.0995 875.8004 900.1461 942.3458 955.3435 978.5173 986.5166 1030.8553 1041.7151 1051.7400 1066.5509 1114.0110 1143.6750 1165.1343 1169.4422 1187.2869 1206.2489 1218.9534 1231.2273 1247.8866 1274.0707 1283.1083 1325.6940 1342.4816 1365.2945 1370.2299 1394.0732 1397.2826 1430.0724 1439.8147 1451.4284 1460.2500 1470.7673 1477.4935 1479.5311 1482.2637 1492.8767 1593.0291 1631.8869 2834.7016 2873.0505 2886.3351 2951.0285 3018.2296 3023.6151 3024.1820 3052.8409 3059.4022 3081.9263 3086.3695 3123.0035 3148.6505 3427.9839 3583.6774
redmass: 3.7603 3.9434 3.0405 2.7050 1.0975 3.4102 1.6278 1.8467 3.8585 2.6732 1.6576 1.9596 2.8386 3.6159 3.7772 2.6183 4.0040 2.8981 3.0297 1.4138 3.6260 4.9135 4.3535 4.7797 3.9279 3.8174 1.6705 3.2239 3.4579 3.0229 1.3664 2.2178 1.9111 1.8456 1.9957 1.5054 1.9363 2.4198 1.3118 1.8181 1.5089 1.6150 1.4139 1.6049 3.0107 1.5122 1.6404 2.1935 1.7897 2.0645 1.4829 1.5377 1.2558 2.5315 1.6342 1.2289 2.3658 1.1104 1.0759 1.0938 1.0644 1.3942 1.0914 2.1941 6.8190 7.5198 1.0714 1.0594 1.0650 1.0401 1.0979 1.0820 1.0785 1.0880 1.0893 1.1008 1.0942 1.0875 1.0968 1.0644 1.0654
irintensity: 4.4402 0.8424 1.6341 0.7940 0.1580 2.3254 4.0653 1.5844 0.3512 14.4467 39.5934 77.0834 1.5183 4.0313 6.4739 1.8288 2.3649 16.3525 3.2761 106.5293 10.2718 7.5349 8.8620 25.7977 3.3559 17.9172 13.9995 51.0005 15.4775 34.6485 0.3645 10.5167 13.1252 4.6635 37.4043 5.7380 25.2304 53.2740 2.4242 16.0384 18.5758 22.1530 68.5925 118.5207 18.1678 13.0257 18.4031 3.9337 6.8837 24.3108 6.0007 7.9419 44.6369 6.5528 29.4219 4.0965 22.7050 2.7014 25.8333 19.5254 15.9060 12.3673 17.0040 8.7319 14.7606 0.9174 50.6056 76.4433 159.3449 43.0524 24.0687 9.0057 46.6125 26.6356 34.1496 30.7099 12.7996 10.9966 19.7254 19.4836 30.0988
temp: 298.150 k
press: 1.00000 atm
elementType: 8 8 7 6 6 6 6 6 6 6 6 6 6 6 1 1 1 1 1 1 1 1 1 1 1 1 1 1 1
symmnumber: 1
zpe: 630702.2 jmol-1
zpe.correction: 0.240222 hartree
zpe.thermalcorrener: 0.253765 hartree
zpe.thermalcorrenthalpy: 0.254709 hartree
zpe.thermalcorrgfe: 0.201133 hartree
zpe.sumelectzpe: -632.295534 hartree
zpe.sumelectthermal: -632.281991 hartree
zpe.sumelectthermalent: -632.281047 hartree
zpe.sumelectthermalfe: -632.334623 hartree
dipole: -2.0090 -2.5110 -1.4263
dipole: 3.5179
quadrupole: -67.6771 -85.3206 -86.2851
quadrupole: -3.1500 -4.1556 -5.3991
quadrupole: 12.0838 -5.5597 -6.5242 -3.1500 -4.1556 -5.3991
hfenergy: -632.5357558 hartree
pointgroup: C01 [X(C11H15N1O2)]
dipole: 0.782731 -1.0143866 0.5233753 debye
polarizability: 168.8442417|-0.4001619|139.9128968|-2.3861495|5.5992149|82.5033548 unknown
InChI: InChI=1S/C11H15NO2/c1-7-3-4-8-9(11(7)14)5-12(2)6-10(8)13/h3-4,10,13-14H,5-6H2,1-2H3
charge 0 multiplicity 1
29 atoms
O  -2.078703 2.005025 -0.961732
O  1.582845 -2.224094 -0.19951
N  -2.373522 -0.716224 -0.118379
C  -1.582082 1.526769 0.348126
C  -2.517628 0.407483 0.841874
C  -0.149835 1.015783 0.242269
C  -1.054553 -1.376836 0.024153
C  0.084192 -0.372068 0.072854
C  1.419459 -0.828031 -0.040768
C  0.943615 1.912458 0.291359
C  -3.487311 -1.681609 -0.087377
C  2.53131 0.054076 0.003225
C  2.264084 1.434957 0.171057
C  3.948265 -0.477689 -0.124895
H  -1.633167 2.413178 1.003184
H  -2.273981 0.110439 1.891905
H  -3.560756 0.767368 0.810629
H  -0.901491 -2.069497 -0.823865
H  -1.014965 -2.009806 0.949615
H  0.75235 2.984381 0.411858
H  -4.44064 -1.154958 -0.268006
H  -3.568592 -2.228406 0.884467
H  -3.351369 -2.431138 -0.887928
H  3.105877 2.136282 0.210242
H  -2.251365 1.164897 -1.47514
H  4.120427 -0.989784 -1.094034
H  4.676933 0.347587 -0.068743
H  4.206058 -1.189806 0.685501
H  2.538546 -2.453935 -0.308445
