program: Gaussian 09
title: 000280321
version: EM64L-G09RevD.01
frameworkgroup: C1[X(C22H15NO4)]
method: RPBEPBE
basis: SDD
operation: Freq
keyword: #p
keyword: freq=noraman
keyword: PBEPBE/SDD
title: #p freq=noraman PBEPBE/SDD
converged: YES YES NO NO
title: Mulliken charges:
elementType: O O O O N C C C C C C C C C C C C C C C C C C C C C C H H H H H H H H H H H H H H H
charge: -0.257810 -0.252813 -0.217615 -0.218670 -0.435854 0.368455 -0.024815 0.220789 0.263262 0.315488 -0.576735 0.364210 0.019693 -0.572802 -0.345884 -0.393658 -0.010517 -0.279588 -0.220132 0.079329 0.296358 -0.368001 -0.357998 -0.237602 -0.233212 -0.227501 -0.503517 0.268678 0.296457 0.334518 0.232042 0.232967 0.235428 0.235088 0.268335 0.272660 0.235001 0.235063 0.235435 0.239502 0.227094 0.258870
chargesum: 0.00000
title: Mulliken charges with hydrogens summed into heavy atoms:
elementType: O O O O N C C C C C C C C C C C C C C C C C C C C C C
charge: -0.257810 -0.252813 -0.217615 -0.218670 -0.101336 0.368455 -0.024815 0.220789 0.263262 0.315488 -0.308057 0.364210 0.019693 -0.276345 -0.113842 -0.160691 -0.010517 -0.044160 0.014957 0.079329 0.296358 -0.099666 -0.085338 -0.002601 0.001851 0.007934 0.221950
polarizability: 4.01971322e+02 3.03513855e+01 2.99576676e+02 -1.14803827e+01 1.14209837e+01 1.40405066e+02
1716.lowfreq: -0.0011 -0.0006 0.0007 1.9076 4.5632 7.3297 24.2278 28.2678 44.6776
frequency: 24.2161 28.2424 44.6757 52.3306 62.5148 82.7402 85.3432 115.1883 119.5328 122.3846 137.1750 163.2491 193.3277 214.6909 233.2342 247.1067 263.4421 275.2331 295.9993 308.1732 319.9323 355.6518 380.2971 407.2728 421.0695 441.3066 444.3770 446.5660 501.8929 534.5546 556.5527 580.9366 605.9029 613.6159 627.9568 634.9526 647.8249 655.1130 678.1117 700.3668 705.5058 724.1901 729.1294 739.8489 755.0195 771.2929 804.7894 807.4770 814.6765 826.8202 862.4786 868.1469 881.4698 916.7248 933.7824 940.0647 948.9219 950.8877 978.1404 985.8321 989.4086 991.3864 1006.5406 1026.8102 1039.1649 1058.2229 1085.5974 1102.7449 1109.4140 1118.8981 1150.9979 1157.8287 1163.9189 1175.4618 1182.9219 1189.8004 1245.3836 1257.6509 1263.2492 1276.3534 1317.3593 1320.2804 1341.4226 1377.3741 1384.7259 1387.6412 1407.2559 1416.0068 1420.3972 1425.7611 1434.4155 1451.9198 1465.9567 1477.6291 1484.2423 1498.3229 1538.1257 1561.0481 1585.9762 1596.0133 1606.5361 1608.9875 1618.0209 1626.4505 1632.1692 3004.2494 3109.5884 3127.2834 3130.7983 3140.1653 3144.4813 3148.3288 3150.6397 3156.8419 3159.6582 3161.9354 3167.8203 3171.0223 3175.5299 3515.1281
redmass: 6.7701 6.6778 5.1856 4.2744 4.3078 3.8029 5.6362 7.5459 3.6726 1.2302 6.6216 6.8513 4.9812 5.1525 6.8056 5.6977 5.8790 4.1659 4.6466 8.0732 7.2851 6.0910 6.1968 2.8892 6.3679 6.7409 4.9059 3.8755 5.0489 3.8730 7.6344 5.5409 6.4711 6.4376 4.7196 4.9358 2.6834 7.0828 6.1495 2.3491 5.2909 1.9379 1.7312 5.8322 3.3390 1.4048 2.8319 5.0390 5.6516 6.3361 1.2561 1.6263 5.0162 2.9415 1.6870 2.2394 1.4120 1.4167 6.6658 1.3343 5.2208 1.4460 1.3395 2.2517 2.6540 3.0704 1.6220 3.8053 1.5055 2.4901 1.4523 2.0033 1.9968 1.0590 1.1548 1.1196 2.2137 1.7815 2.3373 2.0162 2.1141 2.0169 3.1647 3.8485 8.4610 6.9788 3.1959 1.6656 1.7551 3.5508 2.2989 1.0509 1.0519 2.2642 3.5317 2.9010 10.0401 7.6255 6.1454 6.8377 6.2186 6.0324 6.5684 5.4577 10.1591 1.0290 1.1048 1.0882 1.0852 1.0882 1.0880 1.1049 1.0926 1.0940 1.0948 1.0937 1.0920 1.1013 1.0983 1.0764
irintensity: 0.9005 2.4838 0.9308 0.0640 1.7952 1.8886 0.2647 1.9118 1.1839 0.1657 3.0761 1.6752 1.0142 4.8540 1.6209 5.5303 2.4852 4.9935 7.1185 1.6184 10.2148 5.9940 11.1762 0.6309 21.9542 0.2277 2.6958 5.7147 12.4965 5.3150 11.2780 1.5452 5.5907 0.5431 4.2221 6.2470 2.4794 16.0479 13.1119 40.5473 10.1652 44.1351 41.0545 35.2235 9.6276 158.9117 9.0329 9.7874 19.2852 8.3158 5.5936 3.2252 2.1367 34.8700 1.0767 17.6007 0.1353 8.4091 46.6032 0.2793 7.8593 2.9730 0.8727 3.6454 2.9909 73.9016 13.9965 9.4813 19.7972 58.5545 28.1275 94.6259 38.1097 0.5544 14.8233 28.6897 39.2626 166.2782 187.2691 56.2865 11.3655 14.4536 164.7593 23.6001 2.8734 47.0842 3.8552 52.6660 14.8515 17.0462 23.3608 11.9365 8.5648 2.2684 8.2546 36.6034 81.7433 80.2128 10.5059 11.7764 51.2947 84.8307 170.2561 242.8171 126.6374 41.0401 17.1725 6.9112 0.3718 4.7424 2.5390 16.0923 21.0971 20.9900 9.9662 7.6552 1.4908 23.9691 20.2766 45.4301
temp: 298.150 k
press: 1.00000 atm
elementType: 8 8 8 8 7 6 6 6 6 6 6 6 6 6 6 6 6 6 6 6 6 6 6 6 6 6 6 1 1 1 1 1 1 1 1 1 1 1 1 1 1 1
symmnumber: 1
zpe: 823075.7 jmol-1
zpe.correction: 0.313493 hartree
zpe.thermalcorrener: 0.335718 hartree
zpe.thermalcorrenthalpy: 0.336662 hartree
zpe.thermalcorrgfe: 0.260574 hartree
zpe.sumelectzpe: -1201.191092 hartree
zpe.sumelectthermal: -1201.168867 hartree
zpe.sumelectthermalent: -1201.167923 hartree
zpe.sumelectthermalfe: -1201.244011 hartree
dipole: -0.9826 -1.0810 3.5983
dipole: 3.8836
quadrupole: -108.5292 -156.1845 -162.3547
quadrupole: 12.2921 0.5356 9.0219
quadrupole: 33.8269 -13.8284 -19.9985 12.2921 0.5356 9.0219
hfenergy: -1201.5045846 hartree
pointgroup: C01 [X(C22H15N1O4)]
dipole: 0.3523553 0.7340756 1.2928684 debye
polarizability: 393.0903423|42.945093|298.5157076|0.5236234|-41.7290095|150.3470137 unknown
InChI: InChI=1S/C22H15NO4/c1-27-22(26)17-12-14(20(24)13-7-3-2-4-8-13)11-16-15-9-5-6-10-18(15)23-21(25)19(16)17/h2-12,23H,1H3
charge 0 multiplicity 1
42 atoms
O  2.926966 -2.429576 0.122464
O  0.492063 -3.173596 1.460579
O  -2.511827 2.399533 -1.280992
O  0.120732 -3.663849 -0.793674
N  3.839371 -0.300612 0.077415
C  1.301711 0.90249 -0.19899
C  1.414688 -0.519476 -0.04262
C  2.516705 1.736275 -0.189178
C  3.786538 1.09709 -0.039527
C  0.24809 -1.335447 -0.035896
C  0.006855 1.459487 -0.357835
C  -1.148438 0.652754 -0.357985
C  2.74531 -1.172898 0.0636
C  -1.020714 -0.754942 -0.205943
C  2.502148 3.152961 -0.318098
C  4.988582 1.851107 -0.016289
C  -2.477054 1.326991 -0.599739
C  3.689523 3.903998 -0.296752
C  4.939321 3.24906 -0.144384
C  0.320044 -2.835651 0.121963
C  -3.741745 0.74254 -0.043498
C  -3.770489 -0.020651 1.156077
C  -4.962741 1.035912 -0.710126
C  -4.999263 -0.487735 1.670834
C  -6.185141 0.553141 -0.204611
C  -6.206393 -0.211044 0.988082
C  0.727017 -4.614517 1.71926
H  -0.135382 2.53343 -0.505854
H  -1.905771 -1.396305 -0.24536
H  4.752831 -0.759005 0.15238
H  1.549503 3.677308 -0.436722
H  5.950091 1.33693 0.100255
H  3.649445 4.992994 -0.397706
H  5.867109 3.830438 -0.126863
H  -2.843355 -0.219887 1.703626
H  -4.926227 1.646414 -1.61838
H  -5.015479 -1.06314 2.602678
H  -7.119903 0.771568 -0.732029
H  -7.157907 -0.582417 1.384762
H  -0.100767 -5.221738 1.315788
H  0.788709 -4.698308 2.813266
H  1.675141 -4.912131 1.241321
