program: Gaussian 09
title: 000280266
version: EM64L-G09RevD.01
frameworkgroup: C1[X(C12H17NO2)]
method: RPBEPBE
basis: SDD
operation: Freq
keyword: #p
keyword: freq=noraman
keyword: PBEPBE/SDD
title: #p freq=noraman PBEPBE/SDD
converged: NO YES NO NO
title: Mulliken charges:
elementType: O O N C C C C C C C C C C C C H H H H H H H H H H H H H H H H H
charge: -0.318332 -0.272824 -0.469822 0.198394 0.124571 0.331890 0.333181 -0.442855 -0.390311 -0.870592 -0.884892 -0.848978 0.251657 -0.212130 -0.674562 0.228464 0.297537 0.233251 0.233296 0.254450 0.267393 0.233434 0.233381 0.227916 0.233714 0.227907 0.351574 0.227565 0.227565 0.211812 0.228171 0.228173
chargesum: 0.00000
title: Mulliken charges with hydrogens summed into heavy atoms:
elementType: O O N C C C C C C C C C C C C
charge: -0.318332 -0.272824 -0.118248 0.198394 0.124571 0.331890 0.333181 -0.214391 -0.092773 -0.149595 -0.150684 -0.159440 0.251657 0.243000 -0.006406
polarizability: 2.24969538e+02 -1.41250620e+00 1.50273916e+02 -1.01670057e-03 -4.39222530e-03 8.21944179e+01
1716.lowfreq: -14.9060 0.0004 0.0008 0.0009 5.7919 9.3934 23.0712 49.9536 60.9735
frequency: 8.0055 49.9150 60.9278 81.5532 97.9349 114.4015 149.9816 174.3174 194.4533 196.2362 216.7847 249.1995 253.8901 270.3426 317.6271 329.8324 359.7881 362.4238 379.4051 476.0739 502.8436 506.8722 543.0449 583.3480 640.9639 642.4037 699.4814 706.0883 743.0112 756.8945 800.0100 841.3806 843.0816 875.4612 912.9372 972.9633 977.0771 999.1312 1016.1966 1038.7484 1039.7771 1051.6278 1071.5127 1087.7089 1112.6111 1140.4568 1164.9809 1189.8520 1206.8457 1248.5119 1263.6148 1300.2147 1351.6020 1367.1746 1391.1815 1397.8540 1398.5606 1403.2575 1421.6466 1446.1479 1463.3124 1465.9028 1467.3298 1476.4774 1485.6998 1486.6271 1490.4684 1504.8743 1505.4656 1525.4674 1600.7396 1613.9982 1666.1428 2950.7813 2966.6543 2971.5562 2992.6901 3005.8872 3014.5215 3040.1845 3040.7494 3063.0668 3075.8619 3090.6437 3102.6806 3103.5607 3111.3619 3124.2787 3189.5533 3557.6101
redmass: 2.4436 3.1561 5.4306 3.7586 1.6377 2.7606 1.7186 1.7509 4.3179 1.3336 1.1211 4.7049 1.1866 2.4088 5.7683 2.9217 4.0550 2.7430 3.5004 4.1425 3.4285 3.1856 4.8895 2.7933 4.7452 1.3922 5.8957 5.8831 3.4720 4.8676 1.0936 2.9733 1.3257 3.5696 2.6833 1.3172 2.5155 1.3567 1.3953 2.6161 1.5107 1.6568 2.0311 2.5670 2.1757 1.4657 2.8065 1.4604 4.1622 1.1299 1.8759 3.3306 1.7051 2.9748 1.2492 1.2605 1.2432 1.2229 3.3433 1.8419 1.0409 1.0472 1.1310 1.0569 1.0458 1.2921 1.0893 1.3075 1.0485 1.8683 5.1138 6.5488 8.2004 1.0425 1.0377 1.0405 1.0354 1.0580 1.0976 1.0973 1.0977 1.1067 1.0978 1.0986 1.1027 1.0939 1.0914 1.0908 1.0943 1.0752
irintensity: 0.0743 0.2288 4.2779 0.8742 1.3668 1.4914 1.1565 4.1410 6.4231 0.1054 1.8546 0.0192 0.4262 8.6843 9.0574 4.8117 0.4248 0.7403 4.2860 1.4900 2.0851 0.0350 2.8288 15.4663 0.3837 37.5684 44.3664 9.3654 1.5012 2.3010 3.9993 2.2466 42.6301 0.7648 8.4459 4.7895 139.9530 9.8012 9.8247 178.4610 0.5898 1.1526 34.7528 101.3287 3.8954 4.7139 361.4724 27.8068 23.0821 0.0321 3.5840 21.1685 64.1513 21.7119 3.3079 6.2447 37.3384 18.4832 65.0310 40.2697 11.4208 31.4581 16.2341 15.3225 1.0216 68.1213 23.5299 97.2770 3.1744 404.8530 32.9024 45.7558 261.9315 34.8719 45.1410 35.3234 23.9624 26.9222 21.0385 34.9575 9.2984 8.8736 22.4028 33.8490 48.5061 23.4373 11.6193 22.1690 3.6283 35.6463
temp: 298.150 k
press: 1.00000 atm
elementType: 8 8 7 6 6 6 6 6 6 6 6 6 6 6 6 1 1 1 1 1 1 1 1 1 1 1 1 1 1 1 1 1
symmnumber: 1
zpe: 700738.4 jmol-1
zpe.correction: 0.266897 hartree
zpe.thermalcorrener: 0.283290 hartree
zpe.thermalcorrenthalpy: 0.284234 hartree
zpe.thermalcorrgfe: 0.221422 hartree
zpe.sumelectzpe: -671.566585 hartree
zpe.sumelectthermal: -671.550192 hartree
zpe.sumelectthermalent: -671.549248 hartree
zpe.sumelectthermalfe: -671.612060 hartree
dipole: 0.0825 2.9635 -0.0015
dipole: 2.9646
quadrupole: -71.6865 -88.7553 -92.6646
quadrupole: -1.8457 0.0015 0.0043
quadrupole: 12.6823 -4.3865 -8.2958 -1.8457 0.0015 0.0043
hfenergy: -671.833482 hartree
pointgroup: C01 [X(C12H17N1O2)]
dipole: -0.0443079 -1.165527 -0.0006 debye
polarizability: 224.9330858|-2.1717797|150.3103674|0.0010613|0.0043817|82.1944179 unknown
InChI: InChI=1S/C12H17NO2/c1-5-15-12(14)13-11-7-6-8(2)9(3)10(11)4/h6-7,13H,5H2,1-4H3
charge 0 multiplicity 1
32 atoms
O  3.31516 -0.41717 -0.000781
O  2.266963 1.696005 0.000684
N  1.060174 -0.35603 -0.000778
C  -2.680762 -0.612867 -0.000296
C  -1.30173 -0.974202 -0.00006
C  -3.060157 0.765659 -0.000327
C  -0.305274 0.052035 -0.00033
C  -2.04361 1.750657 -0.000252
C  -0.676555 1.417022 -0.000332
C  -3.749415 -1.700126 -0.000436
C  -0.859483 -2.43242 0.0004
C  -4.517643 1.204739 -0.000422
C  2.191578 0.441809 -0.000545
C  4.631451 0.279229 0.00011
C  5.701219 -0.808247 -0.000694
H  -2.328371 2.809786 -0.000213
H  0.093934 2.189854 -0.000434
H  -3.668006 -2.354563 -0.889778
H  -3.670705 -2.352171 0.890944
H  -4.762996 -1.271108 -0.002523
H  -1.715245 -3.122737 0.002271
H  -0.253305 -2.679544 -0.895741
H  -0.250771 -2.678169 0.895185
H  -5.064415 0.837692 0.889642
H  -4.586437 2.306331 0.000182
H  -5.063964 0.838717 -0.891203
H  1.255583 -1.358015 -0.001511
H  4.687497 0.92664 -0.894082
H  4.687178 0.925006 0.895503
H  6.703418 -0.34228 -0.000067
H  5.614921 -1.448003 0.894787
H  5.615264 -1.446326 -0.897403
