program: Gaussian 09
title: 000280294
version: EM64L-G09RevD.01
frameworkgroup: C1[X(C14H16Br2O4)]
method: RPBEPBE
basis: SDD
operation: Freq
keyword: #p
keyword: freq=noraman
keyword: PBEPBE/SDD
title: #p freq=noraman PBEPBE/SDD
converged: YES YES NO NO
title: Mulliken charges:
elementType: Br Br O O O O C C C C C C C C C C C C C C H H H H H H H H H H H H H H H H
charge: 0.046370 0.050259 -0.280471 -0.264304 -0.277307 -0.289981 -0.372014 0.310318 0.562807 -0.240676 -0.402425 -0.346535 -0.352971 -0.684846 -0.196750 -0.194959 0.256064 -0.230604 -0.261160 -0.665660 0.256970 0.248620 0.282833 0.207180 0.277718 0.213546 0.222417 0.232006 0.255653 0.256124 0.244417 0.228766 0.219483 0.228066 0.248797 0.212248
chargesum: 0.00000
title: Mulliken charges with hydrogens summed into heavy atoms:
elementType: Br Br O O O O C C C C C C C C C C C C C C
charge: 0.046370 0.050259 -0.280471 -0.264304 -0.277307 -0.289981 0.133577 0.310318 0.562807 0.249337 -0.124707 -0.346535 -0.352971 -0.016877 0.058903 0.061165 0.256064 0.013813 0.187089 0.023451
polarizability: 2.46630584e+02 4.84162481e+00 2.11418464e+02 -5.36454929e+00 -5.07329001e-01 1.59913366e+02
1716.lowfreq: -3.8236 -1.4307 -0.0004 -0.0003 0.0004 5.3593 6.4457 13.7591 29.3171
frequency: 6.3014 13.5433 29.1465 34.2624 45.8996 67.3880 68.2520 71.9934 98.2084 99.8814 124.4946 145.5956 159.6464 172.9155 179.2957 197.9796 222.6539 226.3783 245.4683 250.3994 293.3819 306.6962 310.3138 327.1399 337.7913 407.5190 470.3173 491.4859 502.0431 504.9088 549.3815 562.1147 620.7698 686.4327 694.6033 702.7919 737.1860 772.0100 775.0790 802.7091 807.1418 821.8858 828.1171 859.7372 897.9246 905.2284 955.6341 970.7596 985.0722 995.7567 1022.5819 1024.8940 1035.1224 1065.2798 1094.8197 1111.6775 1127.3004 1135.7596 1150.2723 1155.6792 1189.0393 1194.5623 1205.3707 1218.1049 1254.9428 1278.7493 1322.7330 1343.9627 1352.6113 1355.4705 1387.6848 1391.4953 1402.1191 1414.0914 1419.6324 1454.7735 1456.3211 1461.5469 1462.3506 1476.6575 1484.3029 1490.5918 1552.7770 1570.8843 1600.4457 1650.8680 2973.1863 2991.1658 2992.7365 2995.2489 3025.0184 3033.9580 3083.7511 3086.4930 3089.2995 3092.5220 3110.5256 3115.6939 3152.1205 3170.5742 3174.3524 3182.7447
redmass: 7.4652 6.8464 3.2958 4.0682 6.3541 4.8292 4.9922 3.0894 2.2777 11.0169 4.3958 5.3787 3.3542 3.5268 3.8468 2.8757 1.5472 9.2789 1.3126 5.0066 3.6013 6.9502 7.6033 4.4614 4.2910 3.4789 3.8997 6.6939 4.7798 5.2149 4.5690 4.5756 5.7683 4.5065 8.6970 4.1390 4.1345 2.1838 2.0259 1.3400 1.1154 4.1705 3.3110 1.4105 1.3556 5.6180 4.2156 1.3375 3.1527 1.7891 2.9219 7.0780 5.2026 2.1831 2.1426 2.2796 2.3845 1.5079 1.5099 1.6842 2.2796 1.3708 1.3659 2.9570 1.1227 1.1149 1.4632 9.5304 1.3551 1.2843 1.2334 1.3615 1.7084 2.2042 2.4199 1.1012 1.0958 1.0407 1.0437 1.0549 1.0512 1.0824 6.9643 7.2117 8.0968 7.7374 1.0565 1.0360 1.0442 1.0562 1.0591 1.1044 1.1006 1.0974 1.1036 1.0977 1.1020 1.1052 1.0870 1.0928 1.0879 1.0996
irintensity: 0.0915 0.1317 0.4896 0.9363 0.5800 0.0624 0.7057 0.7725 0.6201 0.8079 4.3571 5.0624 3.6759 3.0043 1.5073 0.2415 3.6951 4.3300 1.5954 2.2798 4.5865 2.2941 3.1022 10.8722 10.7385 4.3945 3.0122 4.7348 2.4755 0.0078 0.1953 10.7370 8.3452 3.2915 75.2268 9.1856 30.9660 51.2770 21.0946 2.2920 5.4789 9.7067 3.7494 30.1992 0.0295 2.6589 73.3606 0.2738 47.5868 2.7604 105.3184 26.2376 272.9367 34.0773 39.7579 39.8381 105.1369 18.3568 9.8538 22.4124 208.7352 9.4919 73.0158 149.2629 4.4415 4.3246 103.6505 4.5003 26.3546 2.0198 21.6947 28.7751 5.8655 52.1711 137.2413 24.1381 16.6698 11.9817 14.0228 13.8301 12.3175 18.9934 36.9169 0.3604 197.8130 405.5108 25.4840 25.6253 17.9826 23.9793 40.4681 8.2765 11.6760 40.8255 1.0789 22.4558 30.0657 35.7958 2.4871 1.5368 2.9783 8.5590
temp: 298.150 k
press: 1.00000 atm
elementType: 35 35 8 8 8 8 6 6 6 6 6 6 6 6 6 6 6 6 6 6 1 1 1 1 1 1 1 1 1 1 1 1 1 1 1 1
symmnumber: 1
zpe: 711338.4 jmol-1
zpe.correction: 0.270935 hartree
zpe.thermalcorrener: 0.293294 hartree
zpe.thermalcorrenthalpy: 0.294238 hartree
zpe.thermalcorrgfe: 0.212984 hartree
zpe.sumelectzpe: -869.354281 hartree
zpe.sumelectthermal: -869.331921 hartree
zpe.sumelectthermalent: -869.330977 hartree
zpe.sumelectthermalfe: -869.412231 hartree
dipole: -2.0405 1.0578 1.5986
dipole: 2.7997
quadrupole: -111.7659 -137.0066 -129.6853
quadrupole: 2.4230 0.0263 -1.1053
quadrupole: 14.3867 -10.8540 -3.5327 2.4230 0.0263 -1.1053
hfenergy: -869.6252153 hartree
pointgroup: C01 [X(C14H16Br2O4)]
dipole: -0.9156445 -0.0279007 0.6116319 debye
polarizability: 243.4835361|-12.9663614|180.6276831|13.0447182|22.7617046|193.851195 unknown
InChI: InChI=1S/C14H16Br2O4/c1-3-18-10(8-13(17)19-4-2)9-20-14-11(15)6-5-7-12(14)16/h5-8H,3-4,9H2,1-2H3
charge 0 multiplicity 1
36 atoms
Br -1.594091 1.966643 2.470418
Br -2.499018 -0.072064 -2.907624
O  -0.946666 0.568814 -0.256071
O  0.909132 -2.44445 0.493325
O  3.672871 1.169266 0.425564
O  3.893308 -1.096868 -0.104191
C  -0.726765 -0.809106 0.234597
C  0.76481 -1.078293 0.338754
C  -2.272601 1.015857 -0.2063
C  2.117785 -3.041187 1.143592
C  1.68836 -0.063607 0.302992
C  -2.765987 1.719635 0.925355
C  -3.141816 0.868932 -1.320257
C  1.754484 -4.483447 1.476997
C  -4.068355 2.256979 0.953183
C  -4.447834 1.398778 -1.313914
C  3.148779 -0.119838 0.194366
C  -4.90704 2.091168 -0.171495
C  5.143551 1.326414 0.237273
C  5.473877 1.620023 -1.229954
H  -1.172192 -1.53945 -0.46845
H  -1.203958 -0.932216 1.227736
H  2.969859 -2.951118 0.45198
H  2.340041 -2.443755 2.049778
H  1.26417 0.943264 0.270969
H  2.619782 -4.97975 1.953504
H  0.896856 -4.53417 2.169929
H  1.498515 -5.043056 0.560914
H  -4.418543 2.798673 1.836011
H  -5.092518 1.274299 -2.188145
H  -5.91887 2.507744 -0.159895
H  5.647516 0.406282 0.582333
H  5.401211 2.172394 0.895091
H  4.921901 2.506855 -1.586313
H  5.214258 0.758137 -1.867277
H  6.556791 1.817615 -1.339077
