program: Gaussian 09
title: 000280285
version: EM64L-G09RevD.01
frameworkgroup: C1[X(C12H26O6P2)]
method: RPBEPBE
basis: SDD
operation: Freq
keyword: #p
keyword: freq=noraman
keyword: PBEPBE/SDD
title: #p freq=noraman PBEPBE/SDD
converged: YES YES NO NO
title: Mulliken charges:
elementType: P P O O O O O O C C C C C C C C C C C C H H H H H H H H H H H H H H H H H H H H H H H H H H
charge: 1.294987 1.294922 -0.526625 -0.514052 -0.526620 -0.514090 -0.632936 -0.632907 -0.844528 -0.844455 -0.079488 -0.079290 -0.254551 -0.214420 -0.254557 -0.214464 -0.649084 -0.677135 -0.649090 -0.677106 0.295087 0.272954 0.272966 0.295074 0.246364 0.246305 0.239202 0.223956 0.207657 0.221773 0.223958 0.239207 0.207818 0.221760 0.215994 0.247695 0.219397 0.207950 0.217406 0.282294 0.215992 0.247699 0.219392 0.207965 0.217396 0.282226
chargesum: 0.00000
title: Mulliken charges with hydrogens summed into heavy atoms:
elementType: P P O O O O O O C C C C C C C C C C C C
charge: 1.294987 1.294922 -0.526625 -0.514052 -0.526620 -0.514090 -0.632936 -0.632907 -0.276487 -0.276415 0.166876 0.167016 0.208607 0.215010 0.208609 0.215114 0.034002 0.030515 0.033993 0.030481
polarizability: 2.56447979e+02 4.86900384e-03 1.77243516e+02 1.16973103e+01 2.61672062e-03 1.76902214e+02
1716.lowfreq: 0.0019 0.0020 0.0021 3.2347 4.9384 14.7527 19.6827 30.1837 36.2808
frequency: 19.2763 30.1746 36.2711 41.4555 42.8835 48.4814 56.2079 61.0339 64.6168 74.1229 81.1395 93.5465 97.8269 112.6966 128.0377 141.2584 144.6471 175.8119 183.4580 194.3210 222.2375 233.3541 237.4454 248.6882 249.3620 262.9743 274.6927 281.3082 283.6905 305.5363 329.6331 333.5447 387.8517 391.5478 411.2279 415.6356 448.7307 464.9566 507.9822 578.5749 599.6679 653.9609 664.5309 683.7976 723.2429 804.6366 804.6717 817.5997 818.5001 835.1958 854.2299 859.2222 861.9275 870.3282 878.2571 906.2569 974.9353 1011.9640 1014.5022 1019.6839 1020.0410 1023.5003 1038.5802 1079.3296 1090.8518 1092.0347 1093.3428 1106.7561 1109.2517 1134.3142 1134.4168 1135.8343 1146.4742 1147.1652 1189.6636 1237.2290 1249.8694 1262.4085 1262.6372 1273.0379 1273.0894 1298.9072 1324.5695 1353.6693 1353.7087 1354.6255 1356.6882 1391.4204 1391.5648 1397.0565 1399.2282 1419.7762 1421.5180 1459.4458 1462.3371 1462.3710 1464.1095 1467.0632 1467.1781 1475.2973 1476.5546 1483.2190 1484.0465 1488.7850 1499.6187 1682.1053 2976.7586 2976.8324 2985.7854 2985.8023 2991.6370 2992.2576 3007.5797 3007.6546 3025.3186 3025.3807 3039.7448 3040.2234 3076.8435 3076.8551 3082.4955 3082.5449 3087.1451 3087.9626 3092.7714 3095.6601 3105.4965 3105.5081 3106.1804 3111.7091 3112.5679 3113.0712
redmass: 4.2689 4.5029 3.2064 3.6823 2.7328 3.5187 2.8869 3.2226 3.2715 3.1949 2.2914 4.1374 3.0473 4.0170 4.1389 2.4036 3.2570 2.3558 2.3453 4.5576 2.9993 1.4115 1.7285 3.6443 3.1216 1.3572 1.2258 2.2647 3.5417 2.9888 5.9421 5.6406 3.7637 3.5624 4.8315 4.3608 4.3511 5.1920 2.6615 4.9744 6.0161 7.1914 6.0037 5.8485 5.6762 1.1199 1.1193 1.1070 1.1016 1.6322 2.0672 3.2758 3.2634 3.5362 3.6872 1.9874 1.1413 2.8780 2.9039 3.2727 2.8614 3.0966 5.9076 2.8797 2.5871 2.1522 2.8004 2.0968 2.2275 1.4097 1.4042 1.1990 1.5587 1.5293 1.3402 1.2540 1.2424 1.1493 1.1495 1.1133 1.1130 1.2303 1.2733 1.2151 1.2181 1.2426 1.2546 1.2272 1.2275 1.2255 1.2265 1.0981 1.1149 1.0377 1.0441 1.0440 1.0385 1.0687 1.0698 1.0673 1.0752 1.0535 1.0625 1.0713 1.0550 6.1875 1.0552 1.0551 1.0358 1.0358 1.0367 1.0370 1.0617 1.0617 1.0598 1.0597 1.1071 1.1071 1.1027 1.1027 1.0977 1.0977 1.0984 1.0981 1.0964 1.0967 1.1044 1.1044 1.1022 1.0985 1.0963 1.1023
irintensity: 3.4483 0.0018 0.2002 2.4025 2.0711 0.2792 0.0408 0.9071 0.3162 3.8097 2.0597 8.9585 0.2954 0.0257 2.1491 7.4165 1.3598 31.4127 0.0054 2.3352 1.1154 13.1530 0.1450 4.1155 9.6127 2.2380 0.0068 8.5130 13.6428 5.0114 1.5271 11.0179 13.3543 5.0255 20.0212 13.8967 24.7560 54.4803 1.1848 26.1552 33.1200 295.0556 6.5270 21.6955 77.9835 10.6671 0.0384 3.7213 0.8002 11.4606 1.8250 297.0138 19.3773 103.2618 84.2792 46.5337 42.4908 1.0140 302.1634 79.1364 130.2198 28.8694 157.0062 5.5612 20.6809 3.2837 5.9303 10.2949 0.3812 3.4606 8.2588 30.1334 0.1557 25.3975 0.0582 12.4791 3.5733 1.3416 0.0052 0.3129 0.0570 1.2633 2.6446 22.9508 2.3514 3.2189 5.0288 7.9154 42.9951 11.6711 32.0920 25.8180 17.3640 13.7324 22.6126 2.9568 2.7181 3.2562 4.9429 2.5305 2.0536 28.5833 0.2028 9.0020 5.8347 1.1486 35.2339 27.9963 7.7689 22.7476 20.3513 23.0732 69.7219 6.9691 9.8116 3.7260 55.2708 18.8188 2.9519 3.0163 84.2422 0.8109 35.7384 10.4701 0.4738 6.4784 24.9197 45.8407 0.0054 34.4496 5.4554 12.3116
temp: 298.150 k
press: 1.00000 atm
elementType: 15 15 8 8 8 8 8 8 6 6 6 6 6 6 6 6 6 6 6 6 1 1 1 1 1 1 1 1 1 1 1 1 1 1 1 1 1 1 1 1 1 1 1 1 1 1
symmnumber: 1
zpe: 985004.1 jmol-1
zpe.correction: 0.375168 hartree
zpe.thermalcorrener: 0.402909 hartree
zpe.thermalcorrenthalpy: 0.403853 hartree
zpe.thermalcorrgfe: 0.313826 hartree
zpe.sumelectzpe: -1604.986579 hartree
zpe.sumelectthermal: -1604.958839 hartree
zpe.sumelectthermalent: -1604.957895 hartree
zpe.sumelectthermalfe: -1605.047921 hartree
dipole: -0.0039 1.0463 -0.0015
dipole: 1.0463
quadrupole: -119.4181 -130.9227 -147.7227
quadrupole: -0.0081 -18.1116 -0.0046
quadrupole: 13.2697 1.7651 -15.0348 -0.0081 -18.1116 -0.0046
hfenergy: -1605.3617474 hartree
pointgroup: C01 [X(C12H26O6P2)]
dipole: 0.0017008 0.4116279 0.0008728 debye
polarizability: 254.8660598|-0.0486743|177.2435479|16.1293883|-0.0109564|178.4841014 unknown
InChI: InChI=1S/C12H26O6P2/c1-5-15-19(13,16-6-2)11-9-10-12-20(14,17-7-3)18-8-4/h9-10H,5-8,11-12H2,1-4H3
charge 0 multiplicity 1
46 atoms
P  2.776387 0.805358 0.651952
P  -2.776233 0.808957 -0.650994
O  4.290426 0.924548 -0.20676
O  1.896469 -0.510005 -0.071428
O  -4.289473 0.928178 0.209138
O  -1.897163 -0.508713 0.069228
O  2.888748 0.589044 2.224471
O  -2.890155 0.595692 -2.223814
C  1.967147 2.411768 0.068814
C  -1.964985 2.413504 -0.065499
C  0.511158 2.452273 0.45049
C  -0.508962 2.45299 -0.447142
C  5.469395 0.190869 0.343239
C  1.736633 -0.591918 -1.55479
C  -5.46949 0.196294 -0.340994
C  -1.736265 -0.593443 1.552342
C  5.467123 -1.28386 -0.070792
C  0.886909 -1.828371 -1.832737
C  -5.468055 -1.279014 0.070967
C  -0.889208 -1.832322 1.827563
H  2.55426 3.204187 0.566557
H  2.123363 2.491024 -1.019441
H  -2.121089 2.491304 1.022877
H  -2.551213 3.207345 -0.562032
H  0.292541 2.45333 1.528378
H  -0.290328 2.454679 -1.525028
H  5.47366 0.299931 1.44448
H  6.328611 0.735167 -0.082518
H  1.227293 0.321513 -1.921192
H  2.740021 -0.658357 -2.017494
H  -6.327927 0.740696 0.086199
H  -5.474521 0.306915 -1.442076
H  -1.22448 0.318204 1.919745
H  -2.739408 -0.658329 2.015813
H  6.390846 -1.774225 0.290071
H  4.603533 -1.816931 0.364189
H  5.429638 -1.384191 -1.169661
H  0.744434 -1.944892 -2.923449
H  1.38175 -2.735121 -1.443923
H  -0.103549 -1.724231 -1.360452
H  -6.392357 -1.768217 -0.28999
H  -4.605102 -1.812056 -0.36531
H  -5.42992 -1.380899 1.169669
H  -0.746097 -1.950926 2.917966
H  -1.386469 -2.737291 1.437684
H  0.101108 -1.729656 1.35468
